記録npm@vitest/utils2.1.9
条件を変更
現在の条件
@vitest/utils @2.1.9debian glibc · x64 · node 22 · npm · node
API ではなくパッケージ全体の合計
プロジェクトに存在した記録のみです。この座標で実行されたものはありません。
観測 — 実際のプロジェクトのビルドがこの座標から報告されました。
サンプルあり — この座標ではまだ実行していない (1)
- プロジェクト観測
- この座標にはなし
- コントラクト検証
- この座標にはなし
- 使用記録
- 7
- 独立した報告ピア
- 1
- 最終記録
- 2026-09-06
開ける証拠
依存関係のヘルス
このリリースの依存関係の組み合わせと失敗観測
観測された問題 1件 ·
変更 2件 ·
正常 1件
| ライブラリ | バージョン | ヘルス | その座標で測定されたこと | プロジェクト |
|---|---|---|---|---|
| @vitest/pretty-format | 2.1.9 | CANDIDATE 相関変更; 組み合わせ未証明 | コントラクト合格 | プロジェクト日 45 件 |
| tinyrainbow | 1.2.0 | CANDIDATE 相関変更; 組み合わせ未証明 | コントラクト合格 | プロジェクト日 45 件 |
| loupe | 3.2.1 | PASS すべての観測で成功 | コントラクト合格 | プロジェクト日 43 件 |
測定列は各依存関係自身のリリースに関するもので、2つのリリースの組み合わせに関するものではありません。リゾルバが2つを並べたという事実は、両者が協調して動く証拠ではありません。
リリースごとの依存バージョン
このパッケージの各リリースが子をどのバージョンに解決したかです。バージョンが動いた子が先に並びます — アップグレードが足元で何かを変えた地点です。
| ライブラリ | 4.1.11 | 4.1.10 | 4.0.18 | 4.0.16 | 4.0.0 | 3.2.7 | 3.2.4 | 3.0.0 | 2.1.9 |
|---|---|---|---|---|---|---|---|---|---|
| @vitest/pretty-format | 4.1.11 | 4.1.10 | 4.0.18 | 4.0.16 | 4.0.0 | 3.2.7 | 3.2.4 | 3.0.0 | 2.1.9 |
| tinyrainbow | 3.1.1 | 3.1.1 | 3.1.1 | 3.0.3 | 3.1.1 | 2.0.0 | 2.0.0 | 2.0.0 | 1.2.0 |
| convert-source-map | 2.0.0 | 2.0.0 | — | — | — | — | — | — | — |
| loupe | — | — | — | — | — | 3.2.1 | 3.2.1 | 3.2.1 | 3.2.1 |
変動: 2 · 全リリースで同一: 2
エッジは、実機でリゾルバがあるリリースを別のリリースの隣に置いたという記録です。両者が一緒に動くという主張ではありません。その問いに答えるのは、ここに行があることではなくサンプルと契約です。
最近の失敗クラスター
-
観測済み PROCESS_START process start failed 証拠の欠落 ×10 2.1.9 → 3.0.0 → 3.2.4 → 3.2.7 executionContext=node sha256:c12549970456…· structured-termination · gap diagnostic-missing証拠品質: partial · 環境バリアント: 3 · 初回記録: 2026-08-31 · 最終観測: 2026-09-16診断再検証候補
-
観測済み UNKNOWN exit 1 ERR_ASSERTION 証拠の欠落 ×6 2.1.9 → 4.1.10 → 4.1.11 executionContext=node · os=linux · runtime=node@22.23 sha256:986d98189e70…node:internal/modules/run_main:<n> · triggerUncaughtException( · ^ · AssertionError [ERR_ASSERTION]: Expected values to be strictly equal:node · unclassified-diagnostic · outer node · gap stage-unknown証拠品質: complete · 環境バリアント: 2 · 初回記録: 2026-09-06 · 最終観測: 2026-09-06診断再検証候補
-
観測済み UNKNOWN exit 1 証拠の欠落 ×3 2.1.9 → 3.0.0 executionContext=node · moduleSystem=esm · os=linux · runtime=node@22.23 sha256:8fd30f2a6304…fil<path>:<n> · throw new Error(errorMsg); · ^ · Error: Vitest failed to access its internal state.node · unclassified-diagnostic · outer node · gap stage-unknown証拠品質: complete · 環境バリアント: 1 · 初回記録: 2026-08-31 · 最終観測: 2026-09-08診断再検証候補
-
観測済み UNKNOWN exit 1 ERR_MODULE_NOT_FOUND 証拠の欠落 ×3 2.1.9 → 4.1.10 executionContext=node · os=linux · runtime=node@22.23 sha256:88af852f99a8…node:internal/modules/package_json_reader:<n> · throw new ERR_MODULE_NOT_FOUND(packageName, fileURLToPath(base), null); · ^ …node · unclassified-diagnostic · outer node · gap stage-unknown証拠品質: complete · 環境バリアント: 2 · 初回記録: 2026-09-04 · 最終観測: 2026-09-06診断再検証候補
-
観測済み UNKNOWN exit 1 証拠の欠落 ×2 2.1.9 executionContext=node · moduleSystem=esm · os=linux · runtime=node@22.23 sha256:42623a56826f…fil<path>:<n> · Object.defineProperty(expect.not, expectAssertionName, { · ^ · TypeError: Object.defineProperty called on non-objectnode · unclassified-diagnostic · outer node · gap stage-unknown証拠品質: complete · 環境バリアント: 1 · 初回記録: 2026-09-03 · 最終観測: 2026-09-04診断再検証候補
-
観測済み UNKNOWN exit 1 証拠の欠落 ×2 2.1.9 executionContext=node · moduleSystem=cjs · os=linux · runtime=node@22.23 sha256:3b3190f2cd44…doc: cannot find package <str> in any of: · ($GOROOT not set) · <path> (from $GOPATH)go · unclassified-diagnostic · outer go · gap stage-unknown証拠品質: complete · 環境バリアント: 1 · 初回記録: 2026-09-04 · 最終観測: 2026-09-04診断再検証候補
-
観測済み UNKNOWN exit 1 証拠の欠落 ×2 2.1.9 executionContext=node · moduleSystem=cjs · os=linux · runtime=node@22.23 sha256:f0288eb0529f…Traceback (most recent call last): · File <str>, line 19, in <module> · AssertionError· unclassified-diagnostic · gap stage-unknown証拠品質: complete · 環境バリアント: 1 · 初回記録: 2026-09-04 · 最終観測: 2026-09-04診断再検証候補
-
観測済み UNKNOWN exit 1 証拠の欠落 ×1 2.1.9 executionContext=node · moduleSystem=cjs · os=linux · runtime=node@22.23 sha256:72ba2d1e946f…<path>: No module named pippython3 · unclassified-diagnostic · outer python3 · gap stage-unknown証拠品質: complete · 環境バリアント: 1 · 初回記録: 2026-08-31 · 最終観測: 2026-08-31診断再検証候補
-
観測済み UNKNOWN exit 1 証拠の欠落 ×1 2.1.9 executionContext=node · moduleSystem=cjs · os=linux · runtime=node@22.23 sha256:91ad26545eb1…node:internal/modules/cjs/loader:<n> · throw err; · ^ · Error: Cannot find module <str>node · unclassified-diagnostic · outer node · gap stage-unknown証拠品質: complete · 環境バリアント: 1 · 初回記録: 2026-08-31 · 最終観測: 2026-08-31診断再検証候補
-
観測済み UNKNOWN exit 1 証拠の欠落 ×1 2.1.9 executionContext=node · moduleSystem=cjs · os=linux · runtime=node@22.23 sha256:d7f5d491441c…Traceback (most recent call last): · File <str>, line 71, in <module> · AssertionError: is_annotated must return True for Annotated· unclassified-diagnostic · gap stage-unknown証拠品質: complete · 環境バリアント: 1 · 初回記録: 2026-08-31 · 最終観測: 2026-08-31診断再検証候補
-
観測済み UNKNOWN exit 1 証拠の欠落 ×1 2.1.9 executionContext=node · moduleSystem=esm · os=linux · runtime=node@22.23 sha256:67b21c7b2753…Contract test failed: TypeError: Cannot assign to read only property <str> of function 'class Assertion { · constructor(obj) { · this._obj = obj; · }node · unclassified-diagnostic · outer node · gap stage-unknown証拠品質: complete · 環境バリアント: 1 · 初回記録: 2026-09-03 · 最終観測: 2026-09-03診断再検証候補
-
観測済み UNKNOWN exit 1 証拠の欠落 ×1 2.1.9 executionContext=node · moduleSystem=esm · os=linux · runtime=node@22.23 sha256:db4b73d5113b…Contract test failed: TypeError: utils.addProperty is not a function · at JestChaiExpect (fil<path>:<n>:<n>) · at Object.use (<url>) …node · unclassified-diagnostic · outer node · gap stage-unknown証拠品質: complete · 環境バリアント: 1 · 初回記録: 2026-09-03 · 最終観測: 2026-09-03診断再検証候補
最も多く報告された 12 件を表示しています。この座標に記録された失敗クラスタは 17 件です。残りは単発の報告です。