Relevésnpm@vitest/utils2.1.9
Changer les conditions
Conditions actuelles
@vitest/utils @2.1.9debian glibc · x64 · node 22 · npm · node
total du paquet, pas une API
Enregistré comme présent dans des projets. Rien n'a été exécuté à cette coordonnée.
Observé — de vrais builds de projets ont fait remonter cette coordonnée.
il y a un échantillon ici et nous ne l'avons pas encore exécuté à cette coordonnée (1)
- Observations de projets
- rien à cette coordonnée
- Vérifications de contrat
- rien à cette coordonnée
- Enregistrements d'usage
- 7
- Pairs rapporteurs indépendants
- 1
- Dernier enregistrement
- 2026-09-06
Santé des dépendances
Combinaisons observées et preuves d'échec pour cette version
Premier échec observé
2.1.9
executionContext=node
10 FAIL
· stage: PROCESS_START
· fingerprint: sha256:c12549970456efb5abdc90b679695c6689107d4f097d612245d6bfb25e01ec32
| Bibliothèque | Version | Santé | Mesuré là-bas | Projets |
|---|---|---|---|---|
| @vitest/pretty-format | 2.1.9 | CANDIDATE Changement corrélé; combinaison non prouvée | contrat réussi | 45 jours-projet |
| tinyrainbow | 1.2.0 | CANDIDATE Changement corrélé; combinaison non prouvée | contrat réussi | 45 jours-projet |
| loupe | 3.2.1 | PASS Toutes les observations ont réussi | contrat réussi | 43 jours-projet |
La colonne de mesure porte sur la version de chaque dépendance elle-même, pas sur la paire. Qu'un résolveur ait placé deux versions côte à côte ne prouve pas qu'elles fonctionnent ensemble.
Versions des dépendances au fil des versions
Ce vers quoi chaque version de ce paquet a résolu ses enfants. L'enfant dont la version a bougé vient en premier : c'est là qu'une mise à jour a changé quelque chose sous vos pieds.
| Bibliothèque | 4.1.11 | 4.1.10 | 4.0.18 | 4.0.16 | 4.0.0 | 3.2.7 | 3.2.4 | 3.0.0 | 2.1.9 |
|---|---|---|---|---|---|---|---|---|---|
| @vitest/pretty-format | 4.1.11 | 4.1.10 | 4.0.18 | 4.0.16 | 4.0.0 | 3.2.7 | 3.2.4 | 3.0.0 | 2.1.9 |
| tinyrainbow | 3.1.1 | 3.1.1 | 3.1.1 | 3.0.3 | 3.1.1 | 2.0.0 | 2.0.0 | 2.0.0 | 1.2.0 |
| convert-source-map | 2.0.0 | 2.0.0 | — | — | — | — | — | — | — |
| loupe | — | — | — | — | — | 3.2.1 | 3.2.1 | 3.2.1 | 3.2.1 |
Ont bougé : 2 · identiques à chaque version : 2
Une arête indique qu'un résolveur a placé une version à côté d'une autre sur une machine réelle. Ce n'est pas une affirmation qu'elles fonctionnent ensemble ; à cette question répondent les échantillons et les contrats, pas la présence d'une ligne.
Clusters d'échecs récents
-
observé PROCESS_START process start failed Lacune de preuve ×10 2.1.9 → 3.0.0 → 3.2.4 → 3.2.7 executionContext=node sha256:c12549970456…· structured-termination · gap diagnostic-missingQualité de preuve: partial · Variantes d’environnement: 3 · Premier relevé: 2026-08-31 · Dernière observation: 2026-09-16Candidat à une revérification diagnostique
-
observé UNKNOWN exit 1 ERR_ASSERTION Lacune de preuve ×6 2.1.9 → 4.1.10 → 4.1.11 executionContext=node · os=linux · runtime=node@22.23 sha256:986d98189e70…node:internal/modules/run_main:<n> · triggerUncaughtException( · ^ · AssertionError [ERR_ASSERTION]: Expected values to be strictly equal:node · unclassified-diagnostic · outer node · gap stage-unknownQualité de preuve: complete · Variantes d’environnement: 2 · Premier relevé: 2026-09-06 · Dernière observation: 2026-09-06Candidat à une revérification diagnostique
-
observé UNKNOWN exit 1 Lacune de preuve ×3 2.1.9 → 3.0.0 executionContext=node · moduleSystem=esm · os=linux · runtime=node@22.23 sha256:8fd30f2a6304…fil<path>:<n> · throw new Error(errorMsg); · ^ · Error: Vitest failed to access its internal state.node · unclassified-diagnostic · outer node · gap stage-unknownQualité de preuve: complete · Variantes d’environnement: 1 · Premier relevé: 2026-08-31 · Dernière observation: 2026-09-08Candidat à une revérification diagnostique
-
observé UNKNOWN exit 1 ERR_MODULE_NOT_FOUND Lacune de preuve ×3 2.1.9 → 4.1.10 executionContext=node · os=linux · runtime=node@22.23 sha256:88af852f99a8…node:internal/modules/package_json_reader:<n> · throw new ERR_MODULE_NOT_FOUND(packageName, fileURLToPath(base), null); · ^ …node · unclassified-diagnostic · outer node · gap stage-unknownQualité de preuve: complete · Variantes d’environnement: 2 · Premier relevé: 2026-09-04 · Dernière observation: 2026-09-06Candidat à une revérification diagnostique
-
observé UNKNOWN exit 1 Lacune de preuve ×2 2.1.9 executionContext=node · moduleSystem=esm · os=linux · runtime=node@22.23 sha256:42623a56826f…fil<path>:<n> · Object.defineProperty(expect.not, expectAssertionName, { · ^ · TypeError: Object.defineProperty called on non-objectnode · unclassified-diagnostic · outer node · gap stage-unknownQualité de preuve: complete · Variantes d’environnement: 1 · Premier relevé: 2026-09-03 · Dernière observation: 2026-09-04Candidat à une revérification diagnostique
-
observé UNKNOWN exit 1 Lacune de preuve ×2 2.1.9 executionContext=node · moduleSystem=cjs · os=linux · runtime=node@22.23 sha256:3b3190f2cd44…doc: cannot find package <str> in any of: · ($GOROOT not set) · <path> (from $GOPATH)go · unclassified-diagnostic · outer go · gap stage-unknownQualité de preuve: complete · Variantes d’environnement: 1 · Premier relevé: 2026-09-04 · Dernière observation: 2026-09-04Candidat à une revérification diagnostique
-
observé UNKNOWN exit 1 Lacune de preuve ×2 2.1.9 executionContext=node · moduleSystem=cjs · os=linux · runtime=node@22.23 sha256:f0288eb0529f…Traceback (most recent call last): · File <str>, line 19, in <module> · AssertionError· unclassified-diagnostic · gap stage-unknownQualité de preuve: complete · Variantes d’environnement: 1 · Premier relevé: 2026-09-04 · Dernière observation: 2026-09-04Candidat à une revérification diagnostique
-
observé UNKNOWN exit 1 Lacune de preuve ×1 2.1.9 executionContext=node · moduleSystem=cjs · os=linux · runtime=node@22.23 sha256:72ba2d1e946f…<path>: No module named pippython3 · unclassified-diagnostic · outer python3 · gap stage-unknownQualité de preuve: complete · Variantes d’environnement: 1 · Premier relevé: 2026-08-31 · Dernière observation: 2026-08-31Candidat à une revérification diagnostique
-
observé UNKNOWN exit 1 Lacune de preuve ×1 2.1.9 executionContext=node · moduleSystem=cjs · os=linux · runtime=node@22.23 sha256:91ad26545eb1…node:internal/modules/cjs/loader:<n> · throw err; · ^ · Error: Cannot find module <str>node · unclassified-diagnostic · outer node · gap stage-unknownQualité de preuve: complete · Variantes d’environnement: 1 · Premier relevé: 2026-08-31 · Dernière observation: 2026-08-31Candidat à une revérification diagnostique
-
observé UNKNOWN exit 1 Lacune de preuve ×1 2.1.9 executionContext=node · moduleSystem=cjs · os=linux · runtime=node@22.23 sha256:d7f5d491441c…Traceback (most recent call last): · File <str>, line 71, in <module> · AssertionError: is_annotated must return True for Annotated· unclassified-diagnostic · gap stage-unknownQualité de preuve: complete · Variantes d’environnement: 1 · Premier relevé: 2026-08-31 · Dernière observation: 2026-08-31Candidat à une revérification diagnostique
-
observé UNKNOWN exit 1 Lacune de preuve ×1 2.1.9 executionContext=node · moduleSystem=esm · os=linux · runtime=node@22.23 sha256:67b21c7b2753…Contract test failed: TypeError: Cannot assign to read only property <str> of function 'class Assertion { · constructor(obj) { · this._obj = obj; · }node · unclassified-diagnostic · outer node · gap stage-unknownQualité de preuve: complete · Variantes d’environnement: 1 · Premier relevé: 2026-09-03 · Dernière observation: 2026-09-03Candidat à une revérification diagnostique
-
observé UNKNOWN exit 1 Lacune de preuve ×1 2.1.9 executionContext=node · moduleSystem=esm · os=linux · runtime=node@22.23 sha256:db4b73d5113b…Contract test failed: TypeError: utils.addProperty is not a function · at JestChaiExpect (fil<path>:<n>:<n>) · at Object.use (<url>) …node · unclassified-diagnostic · outer node · gap stage-unknownQualité de preuve: complete · Variantes d’environnement: 1 · Premier relevé: 2026-09-03 · Dernière observation: 2026-09-03Candidat à une revérification diagnostique
Affichage des 12 plus signalés parmi 17 groupes d’échecs enregistrés. Le reste sont des signalements uniques.