Записиnpm@vitest/utils2.1.9
Изменить условия
Текущие условия
@vitest/utils @2.1.9alpine musl · x64 · node 22 · npm · node
итог по пакету, а не API
1 из 1 прошли
Проверено — эта сеть выполнила контракт в этой координате.
образец есть — наш запуск в этой координате завершился чисто (1)
- Наблюдения в проектах
- 2 / 2
- Проверки контрактом
- 1 / 1
- Записи об использовании
- 1
- Независимые сообщившие пиры
- 1
- Последняя запись
- 2026-08-30
Здоровье зависимостей
Наблюдаемые комбинации и свидетельства сбоев для этого выпуска
Первый обнаруженный сбой
2.1.9
executionContext=node
10 FAIL
· stage: PROCESS_START
· fingerprint: sha256:c12549970456efb5abdc90b679695c6689107d4f097d612245d6bfb25e01ec32
| Библиотека | Версия | Состояние | Измерено там | Проектов |
|---|---|---|---|---|
| @vitest/pretty-format | 2.1.9 | CANDIDATE Коррелированное изменение; комбинация не подтверждена | контракт пройден | 45 проектных дней |
| tinyrainbow | 1.2.0 | CANDIDATE Коррелированное изменение; комбинация не подтверждена | контракт пройден | 45 проектных дней |
| loupe | 3.2.1 | PASS Все наблюдения прошли успешно | контракт пройден | 43 проектных дня |
Столбец измерения относится к релизу самой зависимости, а не к паре. То, что резолвер поставил два релиза рядом, не доказывает, что они работают вместе.
Версии зависимостей по выпускам
К чему каждый выпуск этого пакета разрешил своих потомков. Потомок, чья версия сдвинулась, идёт первым: там обновление изменило что-то под вами.
| Библиотека | 4.1.11 | 4.1.10 | 4.0.18 | 4.0.16 | 4.0.0 | 3.2.7 | 3.2.4 | 3.0.0 | 2.1.9 |
|---|---|---|---|---|---|---|---|---|---|
| @vitest/pretty-format | 4.1.11 | 4.1.10 | 4.0.18 | 4.0.16 | 4.0.0 | 3.2.7 | 3.2.4 | 3.0.0 | 2.1.9 |
| tinyrainbow | 3.1.1 | 3.1.1 | 3.1.1 | 3.0.3 | 3.1.1 | 2.0.0 | 2.0.0 | 2.0.0 | 1.2.0 |
| convert-source-map | 2.0.0 | 2.0.0 | — | — | — | — | — | — | — |
| loupe | — | — | — | — | — | 3.2.1 | 3.2.1 | 3.2.1 | 3.2.1 |
Сдвинулось: 2 · одинаково во всех выпусках: 2
Ребро фиксирует, что резолвер поставил один релиз рядом с другим на реальной машине. Это не утверждение, что они работают вместе; на этот вопрос отвечают образцы и контракты, а не наличие строки.
Недавние кластеры сбоев
-
наблюдалось PROCESS_START process start failed Пробел в данных ×10 2.1.9 → 3.0.0 → 3.2.4 → 3.2.7 executionContext=node sha256:c12549970456…· structured-termination · gap diagnostic-missingКачество данных: partial · Варианты среды: 3 · Первая запись: 2026-08-31 · Последнее наблюдение: 2026-09-16Кандидат на диагностическую перепроверку
-
наблюдалось UNKNOWN exit 1 ERR_ASSERTION Пробел в данных ×6 2.1.9 → 4.1.10 → 4.1.11 executionContext=node · os=linux · runtime=node@22.23 sha256:986d98189e70…node:internal/modules/run_main:<n> · triggerUncaughtException( · ^ · AssertionError [ERR_ASSERTION]: Expected values to be strictly equal:node · unclassified-diagnostic · outer node · gap stage-unknownКачество данных: complete · Варианты среды: 2 · Первая запись: 2026-09-06 · Последнее наблюдение: 2026-09-06Кандидат на диагностическую перепроверку
-
наблюдалось UNKNOWN exit 1 Пробел в данных ×3 2.1.9 → 3.0.0 executionContext=node · moduleSystem=esm · os=linux · runtime=node@22.23 sha256:8fd30f2a6304…fil<path>:<n> · throw new Error(errorMsg); · ^ · Error: Vitest failed to access its internal state.node · unclassified-diagnostic · outer node · gap stage-unknownКачество данных: complete · Варианты среды: 1 · Первая запись: 2026-08-31 · Последнее наблюдение: 2026-09-08Кандидат на диагностическую перепроверку
-
наблюдалось UNKNOWN exit 1 ERR_MODULE_NOT_FOUND Пробел в данных ×3 2.1.9 → 4.1.10 executionContext=node · os=linux · runtime=node@22.23 sha256:88af852f99a8…node:internal/modules/package_json_reader:<n> · throw new ERR_MODULE_NOT_FOUND(packageName, fileURLToPath(base), null); · ^ …node · unclassified-diagnostic · outer node · gap stage-unknownКачество данных: complete · Варианты среды: 2 · Первая запись: 2026-09-04 · Последнее наблюдение: 2026-09-06Кандидат на диагностическую перепроверку
-
наблюдалось UNKNOWN exit 1 Пробел в данных ×2 2.1.9 executionContext=node · moduleSystem=esm · os=linux · runtime=node@22.23 sha256:42623a56826f…fil<path>:<n> · Object.defineProperty(expect.not, expectAssertionName, { · ^ · TypeError: Object.defineProperty called on non-objectnode · unclassified-diagnostic · outer node · gap stage-unknownКачество данных: complete · Варианты среды: 1 · Первая запись: 2026-09-03 · Последнее наблюдение: 2026-09-04Кандидат на диагностическую перепроверку
-
наблюдалось UNKNOWN exit 1 Пробел в данных ×2 2.1.9 executionContext=node · moduleSystem=cjs · os=linux · runtime=node@22.23 sha256:3b3190f2cd44…doc: cannot find package <str> in any of: · ($GOROOT not set) · <path> (from $GOPATH)go · unclassified-diagnostic · outer go · gap stage-unknownКачество данных: complete · Варианты среды: 1 · Первая запись: 2026-09-04 · Последнее наблюдение: 2026-09-04Кандидат на диагностическую перепроверку
-
наблюдалось UNKNOWN exit 1 Пробел в данных ×2 2.1.9 executionContext=node · moduleSystem=cjs · os=linux · runtime=node@22.23 sha256:f0288eb0529f…Traceback (most recent call last): · File <str>, line 19, in <module> · AssertionError· unclassified-diagnostic · gap stage-unknownКачество данных: complete · Варианты среды: 1 · Первая запись: 2026-09-04 · Последнее наблюдение: 2026-09-04Кандидат на диагностическую перепроверку
-
наблюдалось UNKNOWN exit 1 Пробел в данных ×1 2.1.9 executionContext=node · moduleSystem=cjs · os=linux · runtime=node@22.23 sha256:72ba2d1e946f…<path>: No module named pippython3 · unclassified-diagnostic · outer python3 · gap stage-unknownКачество данных: complete · Варианты среды: 1 · Первая запись: 2026-08-31 · Последнее наблюдение: 2026-08-31Кандидат на диагностическую перепроверку
-
наблюдалось UNKNOWN exit 1 Пробел в данных ×1 2.1.9 executionContext=node · moduleSystem=cjs · os=linux · runtime=node@22.23 sha256:91ad26545eb1…node:internal/modules/cjs/loader:<n> · throw err; · ^ · Error: Cannot find module <str>node · unclassified-diagnostic · outer node · gap stage-unknownКачество данных: complete · Варианты среды: 1 · Первая запись: 2026-08-31 · Последнее наблюдение: 2026-08-31Кандидат на диагностическую перепроверку
-
наблюдалось UNKNOWN exit 1 Пробел в данных ×1 2.1.9 executionContext=node · moduleSystem=cjs · os=linux · runtime=node@22.23 sha256:d7f5d491441c…Traceback (most recent call last): · File <str>, line 71, in <module> · AssertionError: is_annotated must return True for Annotated· unclassified-diagnostic · gap stage-unknownКачество данных: complete · Варианты среды: 1 · Первая запись: 2026-08-31 · Последнее наблюдение: 2026-08-31Кандидат на диагностическую перепроверку
-
наблюдалось UNKNOWN exit 1 Пробел в данных ×1 2.1.9 executionContext=node · moduleSystem=esm · os=linux · runtime=node@22.23 sha256:67b21c7b2753…Contract test failed: TypeError: Cannot assign to read only property <str> of function 'class Assertion { · constructor(obj) { · this._obj = obj; · }node · unclassified-diagnostic · outer node · gap stage-unknownКачество данных: complete · Варианты среды: 1 · Первая запись: 2026-09-03 · Последнее наблюдение: 2026-09-03Кандидат на диагностическую перепроверку
-
наблюдалось UNKNOWN exit 1 Пробел в данных ×1 2.1.9 executionContext=node · moduleSystem=esm · os=linux · runtime=node@22.23 sha256:db4b73d5113b…Contract test failed: TypeError: utils.addProperty is not a function · at JestChaiExpect (fil<path>:<n>:<n>) · at Object.use (<url>) …node · unclassified-diagnostic · outer node · gap stage-unknownКачество данных: complete · Варианты среды: 1 · Первая запись: 2026-09-03 · Последнее наблюдение: 2026-09-03Кандидат на диагностическую перепроверку
Показаны 12 наиболее часто сообщаемых из 17 записанных кластеров отказов. Остальные — единичные сообщения.