Registrosnpm@vitest/spy4.1.11@vitest/spy.isMockFunction
Cambiar las condiciones
Condiciones actuales
@vitest/spy.isMockFunction @4.1.11ubuntu glibc · x64 · node 22 · npm 10 · node
0 de 1 pasaron
Verificado: esta red ejecutó un contrato en esta coordenada.
hay una muestra aquí y nuestra ejecución en esta coordenada falló (1)
- Observaciones de proyectos
- 2 / 2
- Verificaciones de contrato
- 0 / 1
- Peers independientes que reportaron
- 1
- Último registro
- 2026-08-31
Salud de dependencias
Combinaciones observadas y evidencia de fallos para esta versión
Primer fallo observado
3.2.7
windows · node@24.13 · moduleSystem=esm · executionContext=node
31 FAIL
· stage: UNKNOWN
· fingerprint: sha256:9f91c975308128a0f4f23e33b9d5936b9c39535b5c01aa9245b8cdc4b0a37a10
Versiones de dependencias por versión
A qué resolvió sus hijos cada versión de este paquete. Primero va el hijo cuya versión se movió: ahí una actualización cambió algo bajo tus pies.
Se movieron: 1 · iguales en todas las versiones: 0
Una arista registra que un resolutor colocó una versión junto a otra en una máquina real. No afirma que ambas funcionen juntas; a esa pregunta responden las muestras y los contratos, no la presencia de una fila.
Clústeres de fallos recientes
-
observado UNKNOWN exit 1 ERR_ASSERTION Brecha de evidencia ×2 4.1.10 → 4.1.11 executionContext=node · moduleSystem=esm · os=linux · runtime=node@22.23 @vitest/spy.isMockFunction sha256:0323537231f1…Contract test failed: AssertionError [ERR_ASSERTION]: default mock name should be spy · <str> !== <str> · at testFnCreationAndCallTracking (<url>) …node · unclassified-diagnostic · outer node · gap stage-unknownCalidad de evidencia: complete · Variantes de entorno: 1 · Primer registro: 2026-08-31 · Última observación: 2026-08-31Candidato a reverificación diagnóstica
-
observado UNKNOWN exit 1 ERR_ASSERTION Brecha de evidencia ×2 4.1.11 executionContext=node · moduleSystem=esm · os=linux · runtime=node@22.23 sha256:43caf7a060e7…node:internal/modules/run_main:<n> · triggerUncaughtException( · ^ · AssertionError [ERR_ASSERTION]: Expected values to be strictly deep-equal:node · unclassified-diagnostic · outer node · gap stage-unknownCalidad de evidencia: complete · Variantes de entorno: 1 · Primer registro: 2026-09-01 · Última observación: 2026-09-01Candidato a reverificación diagnóstica
-
observado UNKNOWN exit 1 Brecha de evidencia ×1 4.1.11 executionContext=node · moduleSystem=esm · os=linux · runtime=node@22.23 sha256:994722463fe8…fil<path>:<n> · throw Error( · ^ · Error: Invalid Chai property: toSatisfy. Did you mean <str>?node · unclassified-diagnostic · outer node · gap stage-unknownCalidad de evidencia: complete · Variantes de entorno: 1 · Primer registro: 2026-08-31 · Última observación: 2026-08-31Candidato a reverificación diagnóstica
-
observado PROJECT_TEST exit 1 ERR_LOAD_URL ×1 4.1.11 executionContext=node · moduleSystem=esm · os=linux · runtime=node@22.23 sha256:a60e7101af87…Contract test failed: Error: Failed to load custom Reporter from basic · at loadCustomReporterModule (fil<path>:<n>:<n>) · at fil<path>:<n>:<n> …javascript/test-runner · test-runner-diagnostic · outer npm testCalidad de evidencia: complete · Variantes de entorno: 1 · Primer registro: 2026-08-31 · Última observación: 2026-08-31
-
observado UNKNOWN exit 1 ERR_ASSERTION Brecha de evidencia ×1 4.1.11 executionContext=node · moduleSystem=esm · os=linux · runtime=node@22.23 sha256:10e769edac62…node:internal/modules/run_main:<n> · triggerUncaughtException( · ^ · AssertionError [ERR_ASSERTION]: The expression evaluated to a falsy value:node · unclassified-diagnostic · outer node · gap stage-unknownCalidad de evidencia: complete · Variantes de entorno: 1 · Primer registro: 2026-09-01 · Última observación: 2026-09-01Candidato a reverificación diagnóstica