Relevésnpm@vitest/spy4.1.11@vitest/spy.spyOn
Changer les conditions
Conditions actuelles
@vitest/spy.spyOn @4.1.11ubuntu glibc · x64 · node 22 · npm 10 · node
0 sur 1 ont réussi
Vérifié — ce réseau a exécuté un contrat à cette coordonnée.
il y a un échantillon ici et notre exécution à cette coordonnée a échoué (1)
- Observations de projets
- 2 / 2
- Vérifications de contrat
- 0 / 1
- Pairs rapporteurs indépendants
- 1
- Dernier enregistrement
- 2026-08-31
Santé des dépendances
Combinaisons observées et preuves d'échec pour cette version
Premier échec observé
3.2.7
windows · node@24.13 · moduleSystem=esm · executionContext=node
31 FAIL
· stage: UNKNOWN
· fingerprint: sha256:9f91c975308128a0f4f23e33b9d5936b9c39535b5c01aa9245b8cdc4b0a37a10
Versions des dépendances au fil des versions
Ce vers quoi chaque version de ce paquet a résolu ses enfants. L'enfant dont la version a bougé vient en premier : c'est là qu'une mise à jour a changé quelque chose sous vos pieds.
Ont bougé : 1 · identiques à chaque version : 0
Une arête indique qu'un résolveur a placé une version à côté d'une autre sur une machine réelle. Ce n'est pas une affirmation qu'elles fonctionnent ensemble ; à cette question répondent les échantillons et les contrats, pas la présence d'une ligne.
Clusters d'échecs récents
-
observé UNKNOWN exit 1 ERR_ASSERTION Lacune de preuve ×2 4.1.10 → 4.1.11 executionContext=node · moduleSystem=esm · os=linux · runtime=node@22.23 @vitest/spy.spyOn sha256:0323537231f1…Contract test failed: AssertionError [ERR_ASSERTION]: default mock name should be spy · <str> !== <str> · at testFnCreationAndCallTracking (<url>) …node · unclassified-diagnostic · outer node · gap stage-unknownQualité de preuve: complete · Variantes d’environnement: 1 · Premier relevé: 2026-08-31 · Dernière observation: 2026-08-31Candidat à une revérification diagnostique
-
observé UNKNOWN exit 1 ERR_ASSERTION Lacune de preuve ×2 4.1.11 executionContext=node · moduleSystem=esm · os=linux · runtime=node@22.23 sha256:43caf7a060e7…node:internal/modules/run_main:<n> · triggerUncaughtException( · ^ · AssertionError [ERR_ASSERTION]: Expected values to be strictly deep-equal:node · unclassified-diagnostic · outer node · gap stage-unknownQualité de preuve: complete · Variantes d’environnement: 1 · Premier relevé: 2026-09-01 · Dernière observation: 2026-09-01Candidat à une revérification diagnostique
-
observé UNKNOWN exit 1 Lacune de preuve ×1 4.1.11 executionContext=node · moduleSystem=esm · os=linux · runtime=node@22.23 sha256:994722463fe8…fil<path>:<n> · throw Error( · ^ · Error: Invalid Chai property: toSatisfy. Did you mean <str>?node · unclassified-diagnostic · outer node · gap stage-unknownQualité de preuve: complete · Variantes d’environnement: 1 · Premier relevé: 2026-08-31 · Dernière observation: 2026-08-31Candidat à une revérification diagnostique
-
observé PROJECT_TEST exit 1 ERR_LOAD_URL ×1 4.1.11 executionContext=node · moduleSystem=esm · os=linux · runtime=node@22.23 sha256:a60e7101af87…Contract test failed: Error: Failed to load custom Reporter from basic · at loadCustomReporterModule (fil<path>:<n>:<n>) · at fil<path>:<n>:<n> …javascript/test-runner · test-runner-diagnostic · outer npm testQualité de preuve: complete · Variantes d’environnement: 1 · Premier relevé: 2026-08-31 · Dernière observation: 2026-08-31
-
observé UNKNOWN exit 1 ERR_ASSERTION Lacune de preuve ×1 4.1.11 executionContext=node · moduleSystem=esm · os=linux · runtime=node@22.23 sha256:10e769edac62…node:internal/modules/run_main:<n> · triggerUncaughtException( · ^ · AssertionError [ERR_ASSERTION]: The expression evaluated to a falsy value:node · unclassified-diagnostic · outer node · gap stage-unknownQualité de preuve: complete · Variantes d’environnement: 1 · Premier relevé: 2026-09-01 · Dernière observation: 2026-09-01Candidat à une revérification diagnostique