Registrosnpm@vitest/runner2.1.9@vitest/runner.beforeAll
Cambiar las condiciones
Condiciones actuales
@vitest/runner.beforeAll @2.1.9ubuntu glibc · x64 · node 22 · npm 10 · node
0 de 2 pasaron
Verificado: esta red ejecutó un contrato en esta coordenada.
hay una muestra aquí y nuestra ejecución en esta coordenada falló (1)
- Observaciones de proyectos
- 3 / 3
- Verificaciones de contrato
- 0 / 2
- Peers independientes que reportaron
- 2
- Último registro
- 2026-09-06
Salud de dependencias
Combinaciones observadas y evidencia de fallos para esta versión
Primer fallo observado
2.1.9
executionContext=node
10 FAIL
· stage: PROCESS_START
· fingerprint: sha256:c12549970456efb5abdc90b679695c6689107d4f097d612245d6bfb25e01ec32
| Biblioteca | Versión | Estado | Medido allí | Proyectos |
|---|---|---|---|---|
| @vitest/utils | 2.1.9 | CANDIDATE Cambio correlacionado; combinación no probada | contrato aprobado | 12 días-proyecto |
| pathe | 1.1.2 | CANDIDATE Cambio correlacionado; combinación no probada | contrato aprobado | 13 días-proyecto |
La columna de medición se refiere a la versión de cada dependencia en sí, no al par. Que un resolutor haya colocado dos versiones juntas no prueba que funcionen juntas.
Versiones de dependencias por versión
A qué resolvió sus hijos cada versión de este paquete. Primero va el hijo cuya versión se movió: ahí una actualización cambió algo bajo tus pies.
| Biblioteca | 4.1.11 | 4.1.10 | 4.0.18 | 4.0.16 | 4.0.0 | 3.2.7 | 3.2.4 | 3.0.0 | 2.1.9 |
|---|---|---|---|---|---|---|---|---|---|
| @vitest/utils | 4.1.11 | 4.1.10 | 4.0.18 | 4.0.16 | 4.0.0 | 3.2.7 | 3.2.4 | 3.0.0 | 2.1.9 |
| pathe | 2.0.3 | 2.0.3 | 2.0.3 | 2.0.3 | 2.0.3 | 2.0.3 | 2.0.3 | 2.0.3 | 1.1.2 |
| strip-literal | — | — | — | — | — | 3.1.0 | 3.1.0 | — | — |
Se movieron: 2 · iguales en todas las versiones: 1
Una arista registra que un resolutor colocó una versión junto a otra en una máquina real. No afirma que ambas funcionen juntas; a esa pregunta responden las muestras y los contratos, no la presencia de una fila.
Clústeres de fallos recientes
-
observado PROCESS_START process start failed Brecha de evidencia ×10 2.1.9 → 3.0.0 → 3.2.4 → 3.2.7 executionContext=node sha256:c12549970456…· structured-termination · gap diagnostic-missingCalidad de evidencia: partial · Variantes de entorno: 3 · Primer registro: 2026-08-31 · Última observación: 2026-09-16Candidato a reverificación diagnóstica
-
observado UNKNOWN exit 1 ERR_ASSERTION Brecha de evidencia ×5 2.1.9 → 4.1.11 executionContext=node · moduleSystem=esm · os=linux · runtime=node@22.23 @vitest/runner.beforeAll sha256:986d98189e70…node:internal/modules/run_main:<n> · triggerUncaughtException( · ^ · AssertionError [ERR_ASSERTION]: Expected values to be strictly equal:node · unclassified-diagnostic · outer node · gap stage-unknownCalidad de evidencia: complete · Variantes de entorno: 1 · Primer registro: 2026-09-06 · Última observación: 2026-09-06Candidato a reverificación diagnóstica
-
observado UNKNOWN exit 1 Brecha de evidencia ×3 2.1.9 → 3.0.0 executionContext=node · moduleSystem=esm · os=linux · runtime=node@22.23 sha256:8fd30f2a6304…fil<path>:<n> · throw new Error(errorMsg); · ^ · Error: Vitest failed to access its internal state.node · unclassified-diagnostic · outer node · gap stage-unknownCalidad de evidencia: complete · Variantes de entorno: 1 · Primer registro: 2026-08-31 · Última observación: 2026-09-08Candidato a reverificación diagnóstica
-
observado UNKNOWN exit 1 Brecha de evidencia ×1 2.1.9 executionContext=node · moduleSystem=cjs · os=linux · runtime=node@22.23 sha256:72ba2d1e946f…<path>: No module named pippython3 · unclassified-diagnostic · outer python3 · gap stage-unknownCalidad de evidencia: complete · Variantes de entorno: 1 · Primer registro: 2026-08-31 · Última observación: 2026-08-31Candidato a reverificación diagnóstica
-
observado UNKNOWN exit 1 Brecha de evidencia ×1 2.1.9 executionContext=node · moduleSystem=cjs · os=linux · runtime=node@22.23 sha256:91ad26545eb1…node:internal/modules/cjs/loader:<n> · throw err; · ^ · Error: Cannot find module <str>node · unclassified-diagnostic · outer node · gap stage-unknownCalidad de evidencia: complete · Variantes de entorno: 1 · Primer registro: 2026-08-31 · Última observación: 2026-08-31Candidato a reverificación diagnóstica
-
observado UNKNOWN exit 1 Brecha de evidencia ×1 2.1.9 executionContext=node · moduleSystem=cjs · os=linux · runtime=node@22.23 sha256:d7f5d491441c…Traceback (most recent call last): · File <str>, line 71, in <module> · AssertionError: is_annotated must return True for Annotated· unclassified-diagnostic · gap stage-unknownCalidad de evidencia: complete · Variantes de entorno: 1 · Primer registro: 2026-08-31 · Última observación: 2026-08-31Candidato a reverificación diagnóstica
-
observado UNKNOWN exit 1 Brecha de evidencia ×1 2.1.9 executionContext=node · moduleSystem=esm · os=linux · runtime=node@22.23 sha256:42623a56826f…fil<path>:<n> · Object.defineProperty(expect.not, expectAssertionName, { · ^ · TypeError: Object.defineProperty called on non-objectnode · unclassified-diagnostic · outer node · gap stage-unknownCalidad de evidencia: complete · Variantes de entorno: 1 · Primer registro: 2026-09-04 · Última observación: 2026-09-04Candidato a reverificación diagnóstica