Registrosnpm@types/node26.3.0
Mudar as condições
Condições atuais
@types/node @26.3.0ubuntu glibc · x64 · node 22 · npm 10 · node
total do pacote, não uma API
0 de 8 passaram
Verificado — esta rede executou um contrato nesta coordenada.
há uma amostra aqui e nossa execução nesta coordenada falhou
- Observações de projetos
- 22 / 22
- Verificações de contrato
- 0 / 8
- Registros de uso
- 2
- Peers independentes que reportaram
- 3
- Último registro
- 2026-08-30
Saúde das dependências
Combinações observadas e evidências de falha para esta versão
Primeira quebra observada
24.13.5
windows · node@24.13 · moduleSystem=esm · executionContext=node
71 FAIL
· stage: UNKNOWN
· fingerprint: sha256:2a128971f89df9428c0ec589634f66c30c0377bb42742d5e47649ac08546a77f
Versões de dependências por versão
Para que cada versão deste pacote resolveu seus filhos. O filho cuja versão se moveu vem primeiro: foi ali que uma atualização mudou algo sob os seus pés.
| Biblioteca | 26.5.1 | 26.4.1 | 26.4.0 | 26.2.0 | 26.1.2 | 24.13.5 | 24.13.3 | 22.20.3 | 22.20.2 | 22.20.1 | 22.19.1 | 22.10.2 | 20.19.43 |
|---|---|---|---|---|---|---|---|---|---|---|---|---|---|
| undici-types | 8.9.0 | 8.3.0 | 8.3.0 | 8.3.0 | 8.3.0 | 7.18.2 | 7.18.2 | 6.21.0 | 6.21.0 | 6.21.0 | 6.21.0 | 6.20.0 | 6.21.0 |
Moveram-se: 1 · iguais em todas as versões: 0
Uma aresta registra que um resolvedor colocou uma versão ao lado de outra em uma máquina real. Não é uma afirmação de que as duas funcionam juntas; essa pergunta é respondida por amostras e contratos, não pela presença de uma linha.
Clusters de falha recentes
-
observado UNKNOWN exit 1 ERR_ASSERTION Lacuna de evidência ×4 26.3.0 → 26.4.0 executionContext=node · os=linux · runtime=node@22.23 sha256:986d98189e70…node:internal/modules/run_main:<n> · triggerUncaughtException( · ^ · AssertionError [ERR_ASSERTION]: Expected values to be strictly equal:node · unclassified-diagnostic · outer node · gap stage-unknownQualidade da evidência: complete · Variantes de ambiente: 2 · Primeiro registro: 2026-08-29 · Visto por último: 2026-08-30Candidato a reverificação diagnóstica
-
observado UNKNOWN exit 1 Lacuna de evidência ×1 26.3.0 executionContext=node · moduleSystem=cjs · os=linux · runtime=node@22.23 sha256:0c06875294a4…Contract test failed: TypeError: Cannot read properties of undefined (reading <str>) · at runContract (<url>) …node · unclassified-diagnostic · outer node · gap stage-unknownQualidade da evidência: complete · Variantes de ambiente: 1 · Primeiro registro: 2026-08-30 · Visto por último: 2026-08-30Candidato a reverificação diagnóstica
-
observado UNKNOWN exit 1 ERR_ASSERTION Lacuna de evidência ×1 26.3.0 executionContext=node · moduleSystem=cjs · os=linux · runtime=node@22.23 sha256:0d62cac8c07a…AssertionError [ERR_ASSERTION]: Expected values to be strictly equal: · + actual - expected · + <str> · - <str>node · unclassified-diagnostic · outer node · gap stage-unknownQualidade da evidência: complete · Variantes de ambiente: 1 · Primeiro registro: 2026-08-30 · Visto por último: 2026-08-30Candidato a reverificação diagnóstica
-
observado UNKNOWN exit 1 Lacuna de evidência ×1 26.3.0 executionContext=node · moduleSystem=cjs · os=linux · runtime=node@22.23 sha256:9630b514e713…Contract test failed: TypeError: this.terminate is not a function · at ProgressBar.set currentAmount [as currentAmount] <path>:<n>:<n>) …node · unclassified-diagnostic · outer node · gap stage-unknownQualidade da evidência: complete · Variantes de ambiente: 1 · Primeiro registro: 2026-08-30 · Visto por último: 2026-08-30Candidato a reverificação diagnóstica
-
observado UNKNOWN exit 1 ERR_ASSERTION Lacuna de evidência ×1 26.3.0 executionContext=node · moduleSystem=cjs · os=linux · runtime=node@22.23 sha256:9ed50b51742b…Contract test failed: AssertionError [ERR_ASSERTION]: Expected values to be strictly equal: · 0 !== 50 · at runContract (<url>) …node · unclassified-diagnostic · outer node · gap stage-unknownQualidade da evidência: complete · Variantes de ambiente: 1 · Primeiro registro: 2026-08-30 · Visto por último: 2026-08-30Candidato a reverificação diagnóstica
-
observado UNKNOWN exit 1 Lacuna de evidência ×1 26.3.0 executionContext=node · moduleSystem=cjs · os=linux · runtime=node@22.23 sha256:a592ca8c2930…Contract test failed: TypeError: this.stream.moveCursor is not a function · at MultiProgress.allocateLines <path>:<n>:<n>) …node · unclassified-diagnostic · outer node · gap stage-unknownQualidade da evidência: complete · Variantes de ambiente: 1 · Primeiro registro: 2026-08-30 · Visto por último: 2026-08-30Candidato a reverificação diagnóstica
-
observado UNKNOWN exit 1 Lacuna de evidência ×1 26.3.0 executionContext=node · moduleSystem=cjs · os=linux · runtime=node@22.23 sha256:e1d65fc7c136…<path>:<n> · throw new Error(`Unsupported arch ${name}`) · ^ · Error: Unsupported arch 1node · unclassified-diagnostic · outer node · gap stage-unknownQualidade da evidência: complete · Variantes de ambiente: 1 · Primeiro registro: 2026-08-30 · Visto por último: 2026-08-30Candidato a reverificação diagnóstica