記録npm@types/jsesc2.5.1
条件を変更
現在の条件
@types/jsesc @2.5.1ubuntu glibc · x64 · node 22 · npm 10 · node
API ではなくパッケージ全体の合計
13 回中 0 回が成功
検証 — このネットワークがこの座標でコントラクトを実行しました。
サンプルあり — この座標で実行し、失敗した (1)
- プロジェクト観測
- 98 / 99
- コントラクト検証
- 0 / 13
- 使用記録
- 32
- 独立した報告ピア
- 3
- 最終記録
- 2026-09-13
開ける証拠
依存関係のヘルス
ある解決処理がこのリリースのツリーを読み、依存関係はありませんでした。欠落ではなく測定結果です。
最近の失敗クラスター
-
観測済み UNKNOWN exit 1 証拠の欠落 ×2 2.5.1 executionContext=node · moduleSystem=esm · os=linux · runtime=node@22.23 sha256:455451e1a14e…<url>]:<n> · import babel from <str>; · ^^^^^ · SyntaxError: The requested module <str> does not provide an export named <str>node · unclassified-diagnostic · outer node · gap stage-unknown証拠品質: complete · 環境バリアント: 1 · 初回記録: 2026-09-02 · 最終観測: 2026-09-05診断再検証候補
-
観測済み UNKNOWN exit 1 ERR_ASSERTION 証拠の欠落 ×1 2.5.1 executionContext=node · moduleSystem=cjs · os=linux · runtime=node@22.23 sha256:986d98189e70…node:internal/modules/run_main:<n> · triggerUncaughtException( · ^ · AssertionError [ERR_ASSERTION]: Expected values to be strictly equal:node · unclassified-diagnostic · outer node · gap stage-unknown証拠品質: complete · 環境バリアント: 1 · 初回記録: 2026-08-30 · 最終観測: 2026-08-30診断再検証候補
-
観測済み UNKNOWN exit 1 ERR_ASSERTION 証拠の欠落 ×1 2.5.1 executionContext=node · moduleSystem=esm · os=linux · runtime=node@22.23 sha256:c713e7987e7b…node:internal/modules/run_main:<n> · triggerUncaughtException( · ^ · AssertionError [ERR_ASSERTION]: Inner visitor must handle ForOfStatementnode · unclassified-diagnostic · outer node · gap stage-unknown証拠品質: complete · 環境バリアント: 1 · 初回記録: 2026-08-31 · 最終観測: 2026-08-31診断再検証候補
-
観測済み UNKNOWN exit 1 証拠の欠落 ×1 2.5.1 executionContext=node · moduleSystem=esm · os=linux · runtime=node@22.23 sha256:fb30df1477f2…<url> · assert.strictEqual(output.includes(<str>2.0.0<str>), true); · ^^^^^^^^^^^^^^^^^^^^^^^^^^^^^^^^^^^^^^^^ · SyntaxError: missing ) after argument listnode · unclassified-diagnostic · outer node · gap stage-unknown証拠品質: complete · 環境バリアント: 1 · 初回記録: 2026-09-02 · 最終観測: 2026-09-02診断再検証候補
-
観測済み UNKNOWN exit 1 証拠の欠落 ×1 2.5.1 executionContext=node · moduleSystem=esm · os=linux · runtime=node@22.23 sha256:ff4ca6a168fb…fil<path>:<n> · const error = new SyntaxError(); · ^ · SyntaxError: unknown: <str> outside of function. (10:<n>)node · unclassified-diagnostic · outer node · gap stage-unknown証拠品質: complete · 環境バリアント: 1 · 初回記録: 2026-09-02 · 最終観測: 2026-09-02診断再検証候補
-
観測済み UNKNOWN exit 1 ERR_ASSERTION 証拠の欠落 ×1 2.5.1 executionContext=node · moduleSystem=esm · os=linux · runtime=node@22.23 sha256:963dc79aa288…node:internal/modules/run_main:<n> · triggerUncaughtException( · ^ · AssertionError [ERR_ASSERTION]: Arrow function must be converted to function expressionnode · unclassified-diagnostic · outer node · gap stage-unknown証拠品質: complete · 環境バリアント: 1 · 初回記録: 2026-09-03 · 最終観測: 2026-09-03診断再検証候補
-
観測済み PROCESS_START process start failed 証拠の欠落 ×1 2.5.1 executionContext=node · moduleSystem=cjs · os=linux · runtime=node@22.23 sha256:c12549970456…· structured-termination · gap diagnostic-missing証拠品質: partial · 環境バリアント: 1 · 初回記録: 2026-09-05 · 最終観測: 2026-09-05診断再検証候補
-
観測済み PROJECT_RESOLVE exit 1 ×1 2.5.1 executionContext=node · moduleSystem=cjs · os=linux · runtime=node@22.23 sha256:15e1b71df43a…test_contract.go:<n>:<n>: no required module provides package golang.org/x/text/unicode/norm: go.mod file not found in current directory or any parent …go/module · resolve-diagnostic · outer go run証拠品質: complete · 環境バリアント: 1 · 初回記録: 2026-09-05 · 最終観測: 2026-09-05
-
観測済み UNKNOWN exit 1 証拠の欠落 ×1 2.5.1 executionContext=node · moduleSystem=esm · os=linux · runtime=node@22.23 sha256:036052acb454…[eval]:<n> · const inst1 = plugin(api, { method: <str>, include: [<str>, <str>] }); · ^ · TypeError: plugin is not a functionnode · unclassified-diagnostic · outer node · gap stage-unknown証拠品質: complete · 環境バリアント: 1 · 初回記録: 2026-09-05 · 最終観測: 2026-09-05診断再検証候補
-
観測済み UNKNOWN exit 1 証拠の欠落 ×1 2.5.1 executionContext=node · moduleSystem=cjs · os=linux · runtime=node@22.23 sha256:138a106a5937…stat main.go: no such file or directorygo · unclassified-diagnostic · outer go run · gap stage-unknown証拠品質: complete · 環境バリアント: 1 · 初回記録: 2026-09-05 · 最終観測: 2026-09-05診断再検証候補
-
観測済み UNKNOWN exit 1 証拠の欠落 ×1 2.5.1 executionContext=node · moduleSystem=cjs · os=linux · runtime=node@22.23 sha256:69ab38336834…assertion 1 failed: expected text/plain; version=0.0.4; charset=utf-8, got text/plain; version=0.0.4; charset=utf-8; escaping=underscores · exit status 1go · unclassified-diagnostic · outer go run · gap stage-unknown証拠品質: complete · 環境バリアント: 1 · 初回記録: 2026-09-05 · 最終観測: 2026-09-05診断再検証候補
-
観測済み UNKNOWN exit 1 ERR_ASSERTION 証拠の欠落 ×1 2.5.1 executionContext=node · moduleSystem=cjs · os=linux · runtime=node@22.23 sha256:761ce8fa9777…node:assert:<n> · throw new AssertionError(obj); · ^ · AssertionError [ERR_ASSERTION]: Should yield 4 tokens for const answer = 42;node · unclassified-diagnostic · outer node · gap stage-unknown証拠品質: complete · 環境バリアント: 1 · 初回記録: 2026-09-05 · 最終観測: 2026-09-05診断再検証候補
最も多く報告された 12 件を表示しています。この座標に記録された失敗クラスタは 13 件です。残りは単発の報告です。