Registrosnpm@types/debug4.1.13
Mudar as condições
Condições atuais
@types/debug @4.1.13ubuntu glibc · x64 · node 22 · npm 10 · node
total do pacote, não uma API
0 de 9 passaram
Verificado — esta rede executou um contrato nesta coordenada.
há uma amostra aqui e nossa execução nesta coordenada falhou (1)
- Observações de projetos
- 28 / 29
- Verificações de contrato
- 0 / 9
- Registros de uso
- 2
- Peers independentes que reportaram
- 3
- Último registro
- 2026-09-07
Evidências que você pode abrir
Saúde das dependências
Combinações observadas e evidências de falha para esta versão
Problemas observados: 1 ·
Estáveis: 1
Primeira quebra observada
4.1.13
windows · node@24.13 · moduleSystem=esm · executionContext=node
32 FAIL
· stage: UNKNOWN
· fingerprint: sha256:9f91c975308128a0f4f23e33b9d5936b9c39535b5c01aa9245b8cdc4b0a37a10
| Biblioteca | Versão | Saúde | Medido ali | Projetos |
|---|---|---|---|---|
| @types/ms | 2.1.0 | PASS Todas as observações passaram | contrato aprovado | 33 dias-projeto |
A coluna de medição é sobre a versão de cada dependência em si, não sobre o par. Um resolvedor ter colocado duas versões lado a lado não é prova de que funcionam juntas.
Clusters de falha recentes
-
observado UNKNOWN exit 1 Lacuna de evidência ×6 4.1.13 executionContext=node · moduleSystem=cjs sha256:bc4d7ddc5bcd…node:internal/modules/cjs/loader:<n> · throw err; · ^ · Error: Cannot find module <str>npm · unclassified-diagnostic · outer npm run, npm test · gap stage-unknownQualidade da evidência: complete · Variantes de ambiente: 2 · Primeiro registro: 2026-09-02 · Visto por último: 2026-09-14Candidato a reverificação diagnóstica
-
observado UNKNOWN exit 1 Lacuna de evidência ×1 4.1.13 executionContext=node · moduleSystem=cjs · os=linux · runtime=node@22.23 sha256:0c06875294a4…Contract test failed: TypeError: Cannot read properties of undefined (reading <str>) · at runContract (<url>) …node · unclassified-diagnostic · outer node · gap stage-unknownQualidade da evidência: complete · Variantes de ambiente: 1 · Primeiro registro: 2026-08-30 · Visto por último: 2026-08-30Candidato a reverificação diagnóstica
-
observado UNKNOWN exit 1 ERR_ASSERTION Lacuna de evidência ×1 4.1.13 executionContext=node · moduleSystem=cjs · os=linux · runtime=node@22.23 sha256:0d62cac8c07a…AssertionError [ERR_ASSERTION]: Expected values to be strictly equal: · + actual - expected · + <str> · - <str>node · unclassified-diagnostic · outer node · gap stage-unknownQualidade da evidência: complete · Variantes de ambiente: 1 · Primeiro registro: 2026-08-30 · Visto por último: 2026-08-30Candidato a reverificação diagnóstica
-
observado UNKNOWN exit 1 Lacuna de evidência ×1 4.1.13 executionContext=node · moduleSystem=cjs · os=linux · runtime=node@22.23 sha256:9630b514e713…Contract test failed: TypeError: this.terminate is not a function · at ProgressBar.set currentAmount [as currentAmount] <path>:<n>:<n>) …node · unclassified-diagnostic · outer node · gap stage-unknownQualidade da evidência: complete · Variantes de ambiente: 1 · Primeiro registro: 2026-08-30 · Visto por último: 2026-08-30Candidato a reverificação diagnóstica
-
observado UNKNOWN exit 1 ERR_ASSERTION Lacuna de evidência ×1 4.1.13 executionContext=node · moduleSystem=cjs · os=linux · runtime=node@22.23 sha256:9ed50b51742b…Contract test failed: AssertionError [ERR_ASSERTION]: Expected values to be strictly equal: · 0 !== 50 · at runContract (<url>) …node · unclassified-diagnostic · outer node · gap stage-unknownQualidade da evidência: complete · Variantes de ambiente: 1 · Primeiro registro: 2026-08-30 · Visto por último: 2026-08-30Candidato a reverificação diagnóstica
-
observado UNKNOWN exit 1 Lacuna de evidência ×1 4.1.13 executionContext=node · moduleSystem=cjs · os=linux · runtime=node@22.23 sha256:a592ca8c2930…Contract test failed: TypeError: this.stream.moveCursor is not a function · at MultiProgress.allocateLines <path>:<n>:<n>) …node · unclassified-diagnostic · outer node · gap stage-unknownQualidade da evidência: complete · Variantes de ambiente: 1 · Primeiro registro: 2026-08-30 · Visto por último: 2026-08-30Candidato a reverificação diagnóstica
-
observado UNKNOWN exit 1 Lacuna de evidência ×1 4.1.13 executionContext=node · moduleSystem=cjs · os=linux · runtime=node@22.23 sha256:e1d65fc7c136…<path>:<n> · throw new Error(`Unsupported arch ${name}`) · ^ · Error: Unsupported arch 1node · unclassified-diagnostic · outer node · gap stage-unknownQualidade da evidência: complete · Variantes de ambiente: 1 · Primeiro registro: 2026-08-30 · Visto por último: 2026-08-30Candidato a reverificação diagnóstica
-
observado UNKNOWN exit 1 ERR_ASSERTION Lacuna de evidência ×1 4.1.13 executionContext=node · moduleSystem=cjs · os=linux · runtime=node@22.23 sha256:3ae85e0918b4…<path>:<n> · assert.strictEqual(toLinuxArchString(Arch.x64, false), <str>); · ^ · AssertionError [ERR_ASSERTION]: Expected values to be strictly equal:node · unclassified-diagnostic · outer node · gap stage-unknownQualidade da evidência: complete · Variantes de ambiente: 1 · Primeiro registro: 2026-08-31 · Visto por último: 2026-08-31Candidato a reverificação diagnóstica
-
observado PROJECT_TEST exit 1 ×1 4.1.13 executionContext=node · moduleSystem=cjs · os=linux · runtime=node@22.23 sha256:3f00607211aa…Contract test failed: TypeError: Cannot read properties of undefined (reading <str>) · at run (<path>:<n>:<n>) …javascript/test-runner · test-runner-diagnostic · outer npm testQualidade da evidência: complete · Variantes de ambiente: 1 · Primeiro registro: 2026-09-02 · Visto por último: 2026-09-02
-
observado UNKNOWN exit 1 Lacuna de evidência ×1 4.1.13 executionContext=node · moduleSystem=cjs · os=linux · runtime=node@22.23 sha256:bbf23c20e8d6…· unclassified-diagnostic · gap diagnostic-missingQualidade da evidência: partial · Variantes de ambiente: 1 · Primeiro registro: 2026-09-02 · Visto por último: 2026-09-02Candidato a reverificação diagnóstica