記録npm@types/debug4.1.13
条件を変更
現在の条件
@types/debug @4.1.13ubuntu glibc · x64 · node 22 · npm 10 · node
API ではなくパッケージ全体の合計
9 回中 0 回が成功
検証 — このネットワークがこの座標でコントラクトを実行しました。
サンプルあり — この座標で実行し、失敗した (1)
- プロジェクト観測
- 28 / 29
- コントラクト検証
- 0 / 9
- 使用記録
- 2
- 独立した報告ピア
- 3
- 最終記録
- 2026-09-07
開ける証拠
依存関係のヘルス
このリリースの依存関係の組み合わせと失敗観測
観測された問題 1件 ·
正常 1件
| ライブラリ | バージョン | ヘルス | その座標で測定されたこと | プロジェクト |
|---|---|---|---|---|
| @types/ms | 2.1.0 | PASS すべての観測で成功 | コントラクト合格 | プロジェクト日 33 件 |
測定列は各依存関係自身のリリースに関するもので、2つのリリースの組み合わせに関するものではありません。リゾルバが2つを並べたという事実は、両者が協調して動く証拠ではありません。
最近の失敗クラスター
-
観測済み UNKNOWN exit 1 証拠の欠落 ×6 4.1.13 executionContext=node · moduleSystem=cjs sha256:bc4d7ddc5bcd…node:internal/modules/cjs/loader:<n> · throw err; · ^ · Error: Cannot find module <str>npm · unclassified-diagnostic · outer npm run, npm test · gap stage-unknown証拠品質: complete · 環境バリアント: 2 · 初回記録: 2026-09-02 · 最終観測: 2026-09-14診断再検証候補
-
観測済み UNKNOWN exit 1 証拠の欠落 ×1 4.1.13 executionContext=node · moduleSystem=cjs · os=linux · runtime=node@22.23 sha256:0c06875294a4…Contract test failed: TypeError: Cannot read properties of undefined (reading <str>) · at runContract (<url>) …node · unclassified-diagnostic · outer node · gap stage-unknown証拠品質: complete · 環境バリアント: 1 · 初回記録: 2026-08-30 · 最終観測: 2026-08-30診断再検証候補
-
観測済み UNKNOWN exit 1 ERR_ASSERTION 証拠の欠落 ×1 4.1.13 executionContext=node · moduleSystem=cjs · os=linux · runtime=node@22.23 sha256:0d62cac8c07a…AssertionError [ERR_ASSERTION]: Expected values to be strictly equal: · + actual - expected · + <str> · - <str>node · unclassified-diagnostic · outer node · gap stage-unknown証拠品質: complete · 環境バリアント: 1 · 初回記録: 2026-08-30 · 最終観測: 2026-08-30診断再検証候補
-
観測済み UNKNOWN exit 1 証拠の欠落 ×1 4.1.13 executionContext=node · moduleSystem=cjs · os=linux · runtime=node@22.23 sha256:9630b514e713…Contract test failed: TypeError: this.terminate is not a function · at ProgressBar.set currentAmount [as currentAmount] <path>:<n>:<n>) …node · unclassified-diagnostic · outer node · gap stage-unknown証拠品質: complete · 環境バリアント: 1 · 初回記録: 2026-08-30 · 最終観測: 2026-08-30診断再検証候補
-
観測済み UNKNOWN exit 1 ERR_ASSERTION 証拠の欠落 ×1 4.1.13 executionContext=node · moduleSystem=cjs · os=linux · runtime=node@22.23 sha256:9ed50b51742b…Contract test failed: AssertionError [ERR_ASSERTION]: Expected values to be strictly equal: · 0 !== 50 · at runContract (<url>) …node · unclassified-diagnostic · outer node · gap stage-unknown証拠品質: complete · 環境バリアント: 1 · 初回記録: 2026-08-30 · 最終観測: 2026-08-30診断再検証候補
-
観測済み UNKNOWN exit 1 証拠の欠落 ×1 4.1.13 executionContext=node · moduleSystem=cjs · os=linux · runtime=node@22.23 sha256:a592ca8c2930…Contract test failed: TypeError: this.stream.moveCursor is not a function · at MultiProgress.allocateLines <path>:<n>:<n>) …node · unclassified-diagnostic · outer node · gap stage-unknown証拠品質: complete · 環境バリアント: 1 · 初回記録: 2026-08-30 · 最終観測: 2026-08-30診断再検証候補
-
観測済み UNKNOWN exit 1 証拠の欠落 ×1 4.1.13 executionContext=node · moduleSystem=cjs · os=linux · runtime=node@22.23 sha256:e1d65fc7c136…<path>:<n> · throw new Error(`Unsupported arch ${name}`) · ^ · Error: Unsupported arch 1node · unclassified-diagnostic · outer node · gap stage-unknown証拠品質: complete · 環境バリアント: 1 · 初回記録: 2026-08-30 · 最終観測: 2026-08-30診断再検証候補
-
観測済み UNKNOWN exit 1 ERR_ASSERTION 証拠の欠落 ×1 4.1.13 executionContext=node · moduleSystem=cjs · os=linux · runtime=node@22.23 sha256:3ae85e0918b4…<path>:<n> · assert.strictEqual(toLinuxArchString(Arch.x64, false), <str>); · ^ · AssertionError [ERR_ASSERTION]: Expected values to be strictly equal:node · unclassified-diagnostic · outer node · gap stage-unknown証拠品質: complete · 環境バリアント: 1 · 初回記録: 2026-08-31 · 最終観測: 2026-08-31診断再検証候補
-
観測済み PROJECT_TEST exit 1 ×1 4.1.13 executionContext=node · moduleSystem=cjs · os=linux · runtime=node@22.23 sha256:3f00607211aa…Contract test failed: TypeError: Cannot read properties of undefined (reading <str>) · at run (<path>:<n>:<n>) …javascript/test-runner · test-runner-diagnostic · outer npm test証拠品質: complete · 環境バリアント: 1 · 初回記録: 2026-09-02 · 最終観測: 2026-09-02
-
観測済み UNKNOWN exit 1 証拠の欠落 ×1 4.1.13 executionContext=node · moduleSystem=cjs · os=linux · runtime=node@22.23 sha256:bbf23c20e8d6…· unclassified-diagnostic · gap diagnostic-missing証拠品質: partial · 環境バリアント: 1 · 初回記録: 2026-09-02 · 最終観測: 2026-09-02診断再検証候補