Relevésnpm@types/debug4.1.13
Changer les conditions
Conditions actuelles
@types/debug @4.1.13ubuntu glibc · x64 · node 22 · npm 10 · node
total du paquet, pas une API
0 sur 9 ont réussi
Vérifié — ce réseau a exécuté un contrat à cette coordonnée.
il y a un échantillon ici et notre exécution à cette coordonnée a échoué (1)
- Observations de projets
- 28 / 29
- Vérifications de contrat
- 0 / 9
- Enregistrements d'usage
- 2
- Pairs rapporteurs indépendants
- 3
- Dernier enregistrement
- 2026-09-07
Preuves que vous pouvez ouvrir
Santé des dépendances
Combinaisons observées et preuves d'échec pour cette version
Problèmes observés : 1 ·
Stable(s) : 1
Premier échec observé
4.1.13
windows · node@24.13 · moduleSystem=esm · executionContext=node
32 FAIL
· stage: UNKNOWN
· fingerprint: sha256:9f91c975308128a0f4f23e33b9d5936b9c39535b5c01aa9245b8cdc4b0a37a10
| Bibliothèque | Version | Santé | Mesuré là-bas | Projets |
|---|---|---|---|---|
| @types/ms | 2.1.0 | PASS Toutes les observations ont réussi | contrat réussi | 33 jours-projet |
La colonne de mesure porte sur la version de chaque dépendance elle-même, pas sur la paire. Qu'un résolveur ait placé deux versions côte à côte ne prouve pas qu'elles fonctionnent ensemble.
Clusters d'échecs récents
-
observé UNKNOWN exit 1 Lacune de preuve ×6 4.1.13 executionContext=node · moduleSystem=cjs sha256:bc4d7ddc5bcd…node:internal/modules/cjs/loader:<n> · throw err; · ^ · Error: Cannot find module <str>npm · unclassified-diagnostic · outer npm run, npm test · gap stage-unknownQualité de preuve: complete · Variantes d’environnement: 2 · Premier relevé: 2026-09-02 · Dernière observation: 2026-09-14Candidat à une revérification diagnostique
-
observé UNKNOWN exit 1 Lacune de preuve ×1 4.1.13 executionContext=node · moduleSystem=cjs · os=linux · runtime=node@22.23 sha256:0c06875294a4…Contract test failed: TypeError: Cannot read properties of undefined (reading <str>) · at runContract (<url>) …node · unclassified-diagnostic · outer node · gap stage-unknownQualité de preuve: complete · Variantes d’environnement: 1 · Premier relevé: 2026-08-30 · Dernière observation: 2026-08-30Candidat à une revérification diagnostique
-
observé UNKNOWN exit 1 ERR_ASSERTION Lacune de preuve ×1 4.1.13 executionContext=node · moduleSystem=cjs · os=linux · runtime=node@22.23 sha256:0d62cac8c07a…AssertionError [ERR_ASSERTION]: Expected values to be strictly equal: · + actual - expected · + <str> · - <str>node · unclassified-diagnostic · outer node · gap stage-unknownQualité de preuve: complete · Variantes d’environnement: 1 · Premier relevé: 2026-08-30 · Dernière observation: 2026-08-30Candidat à une revérification diagnostique
-
observé UNKNOWN exit 1 Lacune de preuve ×1 4.1.13 executionContext=node · moduleSystem=cjs · os=linux · runtime=node@22.23 sha256:9630b514e713…Contract test failed: TypeError: this.terminate is not a function · at ProgressBar.set currentAmount [as currentAmount] <path>:<n>:<n>) …node · unclassified-diagnostic · outer node · gap stage-unknownQualité de preuve: complete · Variantes d’environnement: 1 · Premier relevé: 2026-08-30 · Dernière observation: 2026-08-30Candidat à une revérification diagnostique
-
observé UNKNOWN exit 1 ERR_ASSERTION Lacune de preuve ×1 4.1.13 executionContext=node · moduleSystem=cjs · os=linux · runtime=node@22.23 sha256:9ed50b51742b…Contract test failed: AssertionError [ERR_ASSERTION]: Expected values to be strictly equal: · 0 !== 50 · at runContract (<url>) …node · unclassified-diagnostic · outer node · gap stage-unknownQualité de preuve: complete · Variantes d’environnement: 1 · Premier relevé: 2026-08-30 · Dernière observation: 2026-08-30Candidat à une revérification diagnostique
-
observé UNKNOWN exit 1 Lacune de preuve ×1 4.1.13 executionContext=node · moduleSystem=cjs · os=linux · runtime=node@22.23 sha256:a592ca8c2930…Contract test failed: TypeError: this.stream.moveCursor is not a function · at MultiProgress.allocateLines <path>:<n>:<n>) …node · unclassified-diagnostic · outer node · gap stage-unknownQualité de preuve: complete · Variantes d’environnement: 1 · Premier relevé: 2026-08-30 · Dernière observation: 2026-08-30Candidat à une revérification diagnostique
-
observé UNKNOWN exit 1 Lacune de preuve ×1 4.1.13 executionContext=node · moduleSystem=cjs · os=linux · runtime=node@22.23 sha256:e1d65fc7c136…<path>:<n> · throw new Error(`Unsupported arch ${name}`) · ^ · Error: Unsupported arch 1node · unclassified-diagnostic · outer node · gap stage-unknownQualité de preuve: complete · Variantes d’environnement: 1 · Premier relevé: 2026-08-30 · Dernière observation: 2026-08-30Candidat à une revérification diagnostique
-
observé UNKNOWN exit 1 ERR_ASSERTION Lacune de preuve ×1 4.1.13 executionContext=node · moduleSystem=cjs · os=linux · runtime=node@22.23 sha256:3ae85e0918b4…<path>:<n> · assert.strictEqual(toLinuxArchString(Arch.x64, false), <str>); · ^ · AssertionError [ERR_ASSERTION]: Expected values to be strictly equal:node · unclassified-diagnostic · outer node · gap stage-unknownQualité de preuve: complete · Variantes d’environnement: 1 · Premier relevé: 2026-08-31 · Dernière observation: 2026-08-31Candidat à une revérification diagnostique
-
observé PROJECT_TEST exit 1 ×1 4.1.13 executionContext=node · moduleSystem=cjs · os=linux · runtime=node@22.23 sha256:3f00607211aa…Contract test failed: TypeError: Cannot read properties of undefined (reading <str>) · at run (<path>:<n>:<n>) …javascript/test-runner · test-runner-diagnostic · outer npm testQualité de preuve: complete · Variantes d’environnement: 1 · Premier relevé: 2026-09-02 · Dernière observation: 2026-09-02
-
observé UNKNOWN exit 1 Lacune de preuve ×1 4.1.13 executionContext=node · moduleSystem=cjs · os=linux · runtime=node@22.23 sha256:bbf23c20e8d6…· unclassified-diagnostic · gap diagnostic-missingQualité de preuve: partial · Variantes d’environnement: 1 · Premier relevé: 2026-09-02 · Dernière observation: 2026-09-02Candidat à une revérification diagnostique