기록npm@rollup/rollup-linux-riscv64-gnu4.63.1
조건 변경
현재 조건
@rollup/rollup-linux-riscv64-gnu @4.63.1ubuntu glibc · x64 · node 22 · npm 10 · node
API가 아니라 패키지 전체 집계
35회 중 0회 통과
검증 — 이 네트워크가 이 좌표에서 컨트랙트를 직접 실행했습니다.
샘플 있음 — 이 좌표에서 우리가 실행했고 실패함
- 프로젝트 관측
- 90 / 91
- 컨트랙트 검증
- 0 / 35
- 사용 기록
- 19
- 독립 보고 peer
- 3
- 마지막 기록
- 2026-09-10
열어 볼 수 있는 증거
의존성 건강도
아직 이 릴리스를 해석한 곳이 없습니다. 의존성이 없는 것이 아니라 읽히지 않은 것입니다. 어디에 집계되는지 보기
최근 실패 클러스터
-
관측됨 PROCESS_START process start failed 증거 공백 ×40 4.62.4 → 4.63.0 → 4.63.1 → 4.63.2 executionContext=node sha256:c12549970456…· structured-termination · gap diagnostic-missing증거 품질: partial · 환경 변형: 3 · 최초 관측: 2026-08-31 · 마지막 관측: 2026-09-16진단 재검증 후보
-
관측됨 UNKNOWN exit 1 ERR_MODULE_NOT_FOUND 증거 공백 ×5 4.63.1 → 4.63.2 executionContext=node · moduleSystem=cjs · os=linux · runtime=node@22.23 sha256:88af852f99a8…node:internal/modules/package_json_reader:<n> · throw new ERR_MODULE_NOT_FOUND(packageName, fileURLToPath(base), null); · ^ …node · unclassified-diagnostic · outer node · gap stage-unknown증거 품질: complete · 환경 변형: 1 · 최초 관측: 2026-09-03 · 마지막 관측: 2026-09-14진단 재검증 후보
-
관측됨 UNKNOWN exit 1 ERR_ASSERTION 증거 공백 ×4 4.63.1 executionContext=node · os=linux · runtime=node@22.23 sha256:986d98189e70…node:internal/modules/run_main:<n> · triggerUncaughtException( · ^ · AssertionError [ERR_ASSERTION]: Expected values to be strictly equal:node · unclassified-diagnostic · outer node · gap stage-unknown증거 품질: complete · 환경 변형: 2 · 최초 관측: 2026-09-03 · 마지막 관측: 2026-09-06진단 재검증 후보
-
관측됨 UNKNOWN exit 1 증거 공백 ×3 4.63.1 executionContext=node · moduleSystem=esm · os=linux · runtime=node@22.23 sha256:8fd30f2a6304…fil<path>:<n> · throw new Error(errorMsg); · ^ · Error: Vitest failed to access its internal state.node · unclassified-diagnostic · outer node · gap stage-unknown증거 품질: complete · 환경 변형: 1 · 최초 관측: 2026-08-31 · 마지막 관측: 2026-09-08진단 재검증 후보
-
관측됨 UNKNOWN exit 1 증거 공백 ×2 4.63.0 → 4.63.1 executionContext=node · moduleSystem=cjs · os=linux · runtime=node@22.23 sha256:91ad26545eb1…node:internal/modules/cjs/loader:<n> · throw err; · ^ · Error: Cannot find module <str>node · unclassified-diagnostic · outer node · gap stage-unknown증거 품질: complete · 환경 변형: 1 · 최초 관측: 2026-08-31 · 마지막 관측: 2026-09-07진단 재검증 후보
-
관측됨 UNKNOWN exit 1 증거 공백 ×1 4.63.1 executionContext=node · moduleSystem=cjs · os=linux · runtime=node@22.23 sha256:0cd3a66e3ae2…Contract failed: Error: Unexpected require: <path> · at mockRequire (<url>) · at eval (eval at evaluateCjs (<url>), <anonymous>:<n>:<n>) …node · unclassified-diagnostic · outer node · gap stage-unknown증거 품질: complete · 환경 변형: 1 · 최초 관측: 2026-09-03 · 마지막 관측: 2026-09-03진단 재검증 후보
-
관측됨 UNKNOWN exit 1 증거 공백 ×1 4.63.1 executionContext=node · moduleSystem=cjs · os=linux · runtime=node@22.23 sha256:b4964cdcf3b0…Contract failed: Error: Unexpected require: external-dep-b · at mockRequire (<url>) · at eval (eval at evaluateCjs (<url>), <anonymous>:<n>:<n>) …node · unclassified-diagnostic · outer node · gap stage-unknown증거 품질: complete · 환경 변형: 1 · 최초 관측: 2026-09-03 · 마지막 관측: 2026-09-03진단 재검증 후보
-
관측됨 UNKNOWN exit 1 증거 공백 ×1 4.63.1 executionContext=node · moduleSystem=esm · os=linux · runtime=node@22.23 sha256:42623a56826f…fil<path>:<n> · Object.defineProperty(expect.not, expectAssertionName, { · ^ · TypeError: Object.defineProperty called on non-objectnode · unclassified-diagnostic · outer node · gap stage-unknown증거 품질: complete · 환경 변형: 1 · 최초 관측: 2026-09-04 · 마지막 관측: 2026-09-04진단 재검증 후보
-
관측됨 UNKNOWN exit 1 ERROR 증거 공백 ×1 4.63.1 executionContext=node · moduleSystem=cjs · os=linux · runtime=node@22.23 sha256:1f882fb2e944…✘ [ERROR] Could not resolve <str> · failed to load config from <path> · <path>:<n> · let error = new Error(text);node · unclassified-diagnostic · outer node · gap stage-unknown증거 품질: complete · 환경 변형: 1 · 최초 관측: 2026-09-04 · 마지막 관측: 2026-09-04진단 재검증 후보
-
관측됨 UNKNOWN exit 1 ERR_ASSERTION 증거 공백 ×1 4.63.1 executionContext=node · moduleSystem=esm · os=linux · runtime=node@22.23 sha256:ac1a96fa941c…Contract test failed: AssertionError [ERR_ASSERTION]: out/preload/index.js must be created by build · at run (<url>) { · generatedMessage: false, …node · unclassified-diagnostic · outer node · gap stage-unknown증거 품질: complete · 환경 변형: 1 · 최초 관측: 2026-09-06 · 마지막 관측: 2026-09-06진단 재검증 후보
-
관측됨 UNKNOWN exit 1 증거 공백 ×1 4.63.1 executionContext=node · moduleSystem=cjs · os=linux · runtime=node@22.23 sha256:148f04041544…atomic: true, · followSymlinks: true, · awaitWriteFinish: false · },node · unclassified-diagnostic · outer node · gap stage-unknown증거 품질: complete · 환경 변형: 1 · 최초 관측: 2026-09-07 · 마지막 관측: 2026-09-07진단 재검증 후보
-
관측됨 UNKNOWN exit 1 ERR_ASSERTION 증거 공백 ×1 4.63.1 executionContext=node · moduleSystem=esm · os=linux · runtime=node@22.23 sha256:43caf7a060e7…node:internal/modules/run_main:<n> · triggerUncaughtException( · ^ · AssertionError [ERR_ASSERTION]: Expected values to be strictly deep-equal:node · unclassified-diagnostic · outer node · gap stage-unknown증거 품질: complete · 환경 변형: 1 · 최초 관측: 2026-09-07 · 마지막 관측: 2026-09-07진단 재검증 후보
가장 많이 보고된 12개를 보여줍니다. 이 좌표에 기록된 실패 클러스터는 19개입니다. 나머지는 단발 보고입니다.