기록npm@napi-rs/lzma-linux-x64-gnu1.5.1lzma
조건 변경
현재 조건
lzma @1.5.1ubuntu glibc · x64 · node 22 · npm 10 · node
2회 중 2회 통과
관측 — 실제 프로젝트 빌드가 이 좌표에서 보고되었습니다.
샘플 있음 — 이 좌표에서는 아직 우리가 실행하지 않음 (3)
- 프로젝트 관측
- 2 / 2
- 컨트랙트 검증
- 이 좌표에는 없음
- 독립 보고 peer
- 1
- 마지막 기록
- 2026-08-20
열어 볼 수 있는 증거
의존성 건강도
어떤 해결 과정이 이 릴리스의 트리를 읽었고 의존성이 없었습니다. 빠진 것이 아니라 측정된 것입니다.
최근 실패 클러스터
-
관측됨 PROCESS_START process start failed 증거 공백 ×40 1.5.1 executionContext=node sha256:c12549970456…· structured-termination · gap diagnostic-missing증거 품질: partial · 환경 변형: 3 · 최초 관측: 2026-08-31 · 마지막 관측: 2026-09-16진단 재검증 후보
-
관측됨 PROJECT_PROCESS ERR_ASSERTION 증거 공백 ×5 1.5.1 executionContext=node · moduleSystem=esm · os=linux · runtime=node@22.23증거 품질: legacy-evidence-incomplete · 환경 변형: 1 · 최초 관측: 2026-08-27 · 마지막 관측: 2026-08-30진단 재검증 후보
-
관측됨 UNKNOWN exit 1 ERR_MODULE_NOT_FOUND 증거 공백 ×5 1.5.1 executionContext=node · moduleSystem=cjs · os=linux · runtime=node@22.23 sha256:88af852f99a8…node:internal/modules/package_json_reader:<n> · throw new ERR_MODULE_NOT_FOUND(packageName, fileURLToPath(base), null); · ^ …node · unclassified-diagnostic · outer node · gap stage-unknown증거 품질: complete · 환경 변형: 1 · 최초 관측: 2026-09-03 · 마지막 관측: 2026-09-14진단 재검증 후보
-
관측됨 PROJECT_TEST ELIFECYCLE 증거 공백 ×4 1.5.1 executionContext=node증거 품질: legacy-evidence-incomplete · 환경 변형: 3 · 최초 관측: 2026-08-25 · 마지막 관측: 2026-08-31진단 재검증 후보
-
관측됨 UNKNOWN exit 1 ERR_ASSERTION 증거 공백 ×4 1.5.1 executionContext=node · os=linux · runtime=node@22.23 sha256:986d98189e70…node:internal/modules/run_main:<n> · triggerUncaughtException( · ^ · AssertionError [ERR_ASSERTION]: Expected values to be strictly equal:node · unclassified-diagnostic · outer node · gap stage-unknown증거 품질: complete · 환경 변형: 2 · 최초 관측: 2026-09-03 · 마지막 관측: 2026-09-05진단 재검증 후보
-
관측됨 UNKNOWN exit 1 증거 공백 ×3 1.5.1 executionContext=node · moduleSystem=esm · os=linux · runtime=node@22.23 sha256:8fd30f2a6304…fil<path>:<n> · throw new Error(errorMsg); · ^ · Error: Vitest failed to access its internal state.node · unclassified-diagnostic · outer node · gap stage-unknown증거 품질: complete · 환경 변형: 1 · 최초 관측: 2026-08-31 · 마지막 관측: 2026-09-08진단 재검증 후보
-
관측됨 UNKNOWN exit 1 증거 공백 ×2 1.5.1 executionContext=node · moduleSystem=cjs · os=linux · runtime=node@22.23 sha256:91ad26545eb1…node:internal/modules/cjs/loader:<n> · throw err; · ^ · Error: Cannot find module <str>node · unclassified-diagnostic · outer node · gap stage-unknown증거 품질: complete · 환경 변형: 1 · 최초 관측: 2026-08-31 · 마지막 관측: 2026-09-07진단 재검증 후보
-
관측됨 UNKNOWN exit 1 증거 공백 ×1 1.5.1 executionContext=node · moduleSystem=cjs · os=linux · runtime=node@22.23 sha256:72ba2d1e946f…<path>: No module named pippython3 · unclassified-diagnostic · outer python3 · gap stage-unknown증거 품질: complete · 환경 변형: 1 · 최초 관측: 2026-08-31 · 마지막 관측: 2026-08-31진단 재검증 후보
-
관측됨 UNKNOWN exit 1 증거 공백 ×1 1.5.1 executionContext=node · moduleSystem=cjs · os=linux · runtime=node@22.23 sha256:d7f5d491441c…Traceback (most recent call last): · File <str>, line 71, in <module> · AssertionError: is_annotated must return True for Annotated· unclassified-diagnostic · gap stage-unknown증거 품질: complete · 환경 변형: 1 · 최초 관측: 2026-08-31 · 마지막 관측: 2026-08-31진단 재검증 후보
-
관측됨 UNKNOWN exit 1 증거 공백 ×1 1.5.1 executionContext=node · moduleSystem=cjs · os=linux · runtime=node@22.23 sha256:0cd3a66e3ae2…Contract failed: Error: Unexpected require: <path> · at mockRequire (<url>) · at eval (eval at evaluateCjs (<url>), <anonymous>:<n>:<n>) …node · unclassified-diagnostic · outer node · gap stage-unknown증거 품질: complete · 환경 변형: 1 · 최초 관측: 2026-09-03 · 마지막 관측: 2026-09-03진단 재검증 후보
-
관측됨 UNKNOWN exit 1 증거 공백 ×1 1.5.1 executionContext=node · moduleSystem=cjs · os=linux · runtime=node@22.23 sha256:223705e02a51…ReferenceError: __dirname is not defined · at get version (fil<path>:<n>:<n>) · at main (<path>:<n>:<n>) · at Object.<anonymous> (<path>:<n>:<n>)node · unclassified-diagnostic · outer node · gap stage-unknown증거 품질: complete · 환경 변형: 1 · 최초 관측: 2026-09-03 · 마지막 관측: 2026-09-03진단 재검증 후보
-
관측됨 UNKNOWN exit 1 ERR_AMBIGUOUS_MODULE_SYNTAX 증거 공백 ×1 1.5.1 executionContext=node · moduleSystem=cjs · os=linux · runtime=node@22.23 sha256:2e857e4a17a1…fil<path>:<n> · const { version } = JSON.parse(readFileSync(join(__dirname, <str>), <str>)); · ^ …node · unclassified-diagnostic · outer node · gap stage-unknown증거 품질: complete · 환경 변형: 1 · 최초 관측: 2026-09-03 · 마지막 관측: 2026-09-03진단 재검증 후보
가장 많이 보고된 12개를 보여줍니다. 이 좌표에 기록된 실패 클러스터는 31개입니다. 나머지는 단발 보고입니다.