Записиnpm@napi-rs/lzma-linux-x64-gnu1.5.1@napi-rs/lzma-linux-x64-gnu.lzma
Изменить условия
Текущие условия
@napi-rs/lzma-linux-x64-gnu.lzma @1.5.1ubuntu glibc · x64 · node 22 · npm 10 · node
2 из 2 прошли
Наблюдение — реальные сборки проектов сообщили об этой координате.
образец есть — в этой координате мы его ещё не запускали (3)
- Наблюдения в проектах
- 2 / 2
- Проверки контрактом
- в этой координате ничего
- Независимые сообщившие пиры
- 1
- Последняя запись
- 2026-08-20
Свидетельства, которые можно открыть
Здоровье зависимостей
Разрешение прочитало дерево этого релиза и не нашло зависимостей. Это измерение, а не его отсутствие.
Недавние кластеры сбоев
-
наблюдалось PROCESS_START process start failed Пробел в данных ×40 1.5.1 executionContext=node sha256:c12549970456…· structured-termination · gap diagnostic-missingКачество данных: partial · Варианты среды: 3 · Первая запись: 2026-08-31 · Последнее наблюдение: 2026-09-16Кандидат на диагностическую перепроверку
-
наблюдалось PROJECT_PROCESS ERR_ASSERTION Пробел в данных ×5 1.5.1 executionContext=node · moduleSystem=esm · os=linux · runtime=node@22.23Качество данных: legacy-evidence-incomplete · Варианты среды: 1 · Первая запись: 2026-08-27 · Последнее наблюдение: 2026-08-30Кандидат на диагностическую перепроверку
-
наблюдалось UNKNOWN exit 1 ERR_MODULE_NOT_FOUND Пробел в данных ×5 1.5.1 executionContext=node · moduleSystem=cjs · os=linux · runtime=node@22.23 sha256:88af852f99a8…node:internal/modules/package_json_reader:<n> · throw new ERR_MODULE_NOT_FOUND(packageName, fileURLToPath(base), null); · ^ …node · unclassified-diagnostic · outer node · gap stage-unknownКачество данных: complete · Варианты среды: 1 · Первая запись: 2026-09-03 · Последнее наблюдение: 2026-09-14Кандидат на диагностическую перепроверку
-
наблюдалось PROJECT_TEST ELIFECYCLE Пробел в данных ×4 1.5.1 executionContext=nodeКачество данных: legacy-evidence-incomplete · Варианты среды: 3 · Первая запись: 2026-08-25 · Последнее наблюдение: 2026-08-31Кандидат на диагностическую перепроверку
-
наблюдалось UNKNOWN exit 1 ERR_ASSERTION Пробел в данных ×4 1.5.1 executionContext=node · os=linux · runtime=node@22.23 sha256:986d98189e70…node:internal/modules/run_main:<n> · triggerUncaughtException( · ^ · AssertionError [ERR_ASSERTION]: Expected values to be strictly equal:node · unclassified-diagnostic · outer node · gap stage-unknownКачество данных: complete · Варианты среды: 2 · Первая запись: 2026-09-03 · Последнее наблюдение: 2026-09-05Кандидат на диагностическую перепроверку
-
наблюдалось UNKNOWN exit 1 Пробел в данных ×3 1.5.1 executionContext=node · moduleSystem=esm · os=linux · runtime=node@22.23 sha256:8fd30f2a6304…fil<path>:<n> · throw new Error(errorMsg); · ^ · Error: Vitest failed to access its internal state.node · unclassified-diagnostic · outer node · gap stage-unknownКачество данных: complete · Варианты среды: 1 · Первая запись: 2026-08-31 · Последнее наблюдение: 2026-09-08Кандидат на диагностическую перепроверку
-
наблюдалось UNKNOWN exit 1 Пробел в данных ×2 1.5.1 executionContext=node · moduleSystem=cjs · os=linux · runtime=node@22.23 sha256:91ad26545eb1…node:internal/modules/cjs/loader:<n> · throw err; · ^ · Error: Cannot find module <str>node · unclassified-diagnostic · outer node · gap stage-unknownКачество данных: complete · Варианты среды: 1 · Первая запись: 2026-08-31 · Последнее наблюдение: 2026-09-07Кандидат на диагностическую перепроверку
-
наблюдалось UNKNOWN exit 1 Пробел в данных ×1 1.5.1 executionContext=node · moduleSystem=cjs · os=linux · runtime=node@22.23 sha256:72ba2d1e946f…<path>: No module named pippython3 · unclassified-diagnostic · outer python3 · gap stage-unknownКачество данных: complete · Варианты среды: 1 · Первая запись: 2026-08-31 · Последнее наблюдение: 2026-08-31Кандидат на диагностическую перепроверку
-
наблюдалось UNKNOWN exit 1 Пробел в данных ×1 1.5.1 executionContext=node · moduleSystem=cjs · os=linux · runtime=node@22.23 sha256:d7f5d491441c…Traceback (most recent call last): · File <str>, line 71, in <module> · AssertionError: is_annotated must return True for Annotated· unclassified-diagnostic · gap stage-unknownКачество данных: complete · Варианты среды: 1 · Первая запись: 2026-08-31 · Последнее наблюдение: 2026-08-31Кандидат на диагностическую перепроверку
-
наблюдалось UNKNOWN exit 1 Пробел в данных ×1 1.5.1 executionContext=node · moduleSystem=cjs · os=linux · runtime=node@22.23 sha256:0cd3a66e3ae2…Contract failed: Error: Unexpected require: <path> · at mockRequire (<url>) · at eval (eval at evaluateCjs (<url>), <anonymous>:<n>:<n>) …node · unclassified-diagnostic · outer node · gap stage-unknownКачество данных: complete · Варианты среды: 1 · Первая запись: 2026-09-03 · Последнее наблюдение: 2026-09-03Кандидат на диагностическую перепроверку
-
наблюдалось UNKNOWN exit 1 Пробел в данных ×1 1.5.1 executionContext=node · moduleSystem=cjs · os=linux · runtime=node@22.23 sha256:223705e02a51…ReferenceError: __dirname is not defined · at get version (fil<path>:<n>:<n>) · at main (<path>:<n>:<n>) · at Object.<anonymous> (<path>:<n>:<n>)node · unclassified-diagnostic · outer node · gap stage-unknownКачество данных: complete · Варианты среды: 1 · Первая запись: 2026-09-03 · Последнее наблюдение: 2026-09-03Кандидат на диагностическую перепроверку
-
наблюдалось UNKNOWN exit 1 ERR_AMBIGUOUS_MODULE_SYNTAX Пробел в данных ×1 1.5.1 executionContext=node · moduleSystem=cjs · os=linux · runtime=node@22.23 sha256:2e857e4a17a1…fil<path>:<n> · const { version } = JSON.parse(readFileSync(join(__dirname, <str>), <str>)); · ^ …node · unclassified-diagnostic · outer node · gap stage-unknownКачество данных: complete · Варианты среды: 1 · Первая запись: 2026-09-03 · Последнее наблюдение: 2026-09-03Кандидат на диагностическую перепроверку
Показаны 12 наиболее часто сообщаемых из 31 записанных кластеров отказов. Остальные — единичные сообщения.