Recordsnpm@napi-rs/lzma-linux-x64-gnu1.5.1
Change the conditions
Current conditions
@napi-rs/lzma-linux-x64-gnu @1.5.1ubuntu glibc · x64 · node 22 · npm 10 · node
package-level total, not an API
0 of 75 passed
Verified — this network ran a contract at this coordinate.
there is a sample here, and our run of it at this coordinate failed (3)
- Project observations
- 186 / 192
- Contract verifications
- 0 / 75
- Usage records
- 57
- Independent reporting peers
- 3
- Failures with a captured fingerprint
- 1 / 6
- Last recorded
- 2026-09-17
Evidence you can open
Dependency Health
A resolution read this release's tree and found no dependencies. That is a measurement, not a missing one.
Recent failure clusters
-
observed PROCESS_START process start failed Evidence gap ×40 1.5.1 executionContext=node sha256:c12549970456…· structured-termination · gap diagnostic-missingEvidence quality: partial · Environment variants: 3 · First recorded: 2026-08-31 · Last seen: 2026-09-16Diagnostic re-verification candidate
-
observed PROJECT_PROCESS ERR_ASSERTION Evidence gap ×5 1.5.1 executionContext=node · moduleSystem=esm · os=linux · runtime=node@22.23Evidence quality: legacy-evidence-incomplete · Environment variants: 1 · First recorded: 2026-08-27 · Last seen: 2026-08-30Diagnostic re-verification candidate
-
observed UNKNOWN exit 1 ERR_MODULE_NOT_FOUND Evidence gap ×5 1.5.1 executionContext=node · moduleSystem=cjs · os=linux · runtime=node@22.23 sha256:88af852f99a8…node:internal/modules/package_json_reader:<n> · throw new ERR_MODULE_NOT_FOUND(packageName, fileURLToPath(base), null); · ^ …node · unclassified-diagnostic · outer node · gap stage-unknownEvidence quality: complete · Environment variants: 1 · First recorded: 2026-09-03 · Last seen: 2026-09-14Diagnostic re-verification candidate
-
observed PROJECT_TEST ELIFECYCLE Evidence gap ×4 1.5.1 executionContext=nodeEvidence quality: legacy-evidence-incomplete · Environment variants: 3 · First recorded: 2026-08-25 · Last seen: 2026-08-31Diagnostic re-verification candidate
-
observed UNKNOWN exit 1 ERR_ASSERTION Evidence gap ×4 1.5.1 executionContext=node · os=linux · runtime=node@22.23 sha256:986d98189e70…node:internal/modules/run_main:<n> · triggerUncaughtException( · ^ · AssertionError [ERR_ASSERTION]: Expected values to be strictly equal:node · unclassified-diagnostic · outer node · gap stage-unknownEvidence quality: complete · Environment variants: 2 · First recorded: 2026-09-03 · Last seen: 2026-09-05Diagnostic re-verification candidate
-
observed UNKNOWN exit 1 Evidence gap ×3 1.5.1 executionContext=node · moduleSystem=esm · os=linux · runtime=node@22.23 sha256:8fd30f2a6304…fil<path>:<n> · throw new Error(errorMsg); · ^ · Error: Vitest failed to access its internal state.node · unclassified-diagnostic · outer node · gap stage-unknownEvidence quality: complete · Environment variants: 1 · First recorded: 2026-08-31 · Last seen: 2026-09-08Diagnostic re-verification candidate
-
observed UNKNOWN exit 1 Evidence gap ×2 1.5.1 executionContext=node · moduleSystem=cjs · os=linux · runtime=node@22.23 sha256:91ad26545eb1…node:internal/modules/cjs/loader:<n> · throw err; · ^ · Error: Cannot find module <str>node · unclassified-diagnostic · outer node · gap stage-unknownEvidence quality: complete · Environment variants: 1 · First recorded: 2026-08-31 · Last seen: 2026-09-07Diagnostic re-verification candidate
-
observed UNKNOWN exit 1 Evidence gap ×1 1.5.1 executionContext=node · moduleSystem=cjs · os=linux · runtime=node@22.23 sha256:72ba2d1e946f…<path>: No module named pippython3 · unclassified-diagnostic · outer python3 · gap stage-unknownEvidence quality: complete · Environment variants: 1 · First recorded: 2026-08-31 · Last seen: 2026-08-31Diagnostic re-verification candidate
-
observed UNKNOWN exit 1 Evidence gap ×1 1.5.1 executionContext=node · moduleSystem=cjs · os=linux · runtime=node@22.23 sha256:d7f5d491441c…Traceback (most recent call last): · File <str>, line 71, in <module> · AssertionError: is_annotated must return True for Annotated· unclassified-diagnostic · gap stage-unknownEvidence quality: complete · Environment variants: 1 · First recorded: 2026-08-31 · Last seen: 2026-08-31Diagnostic re-verification candidate
-
observed UNKNOWN exit 1 Evidence gap ×1 1.5.1 executionContext=node · moduleSystem=cjs · os=linux · runtime=node@22.23 sha256:0cd3a66e3ae2…Contract failed: Error: Unexpected require: <path> · at mockRequire (<url>) · at eval (eval at evaluateCjs (<url>), <anonymous>:<n>:<n>) …node · unclassified-diagnostic · outer node · gap stage-unknownEvidence quality: complete · Environment variants: 1 · First recorded: 2026-09-03 · Last seen: 2026-09-03Diagnostic re-verification candidate
-
observed UNKNOWN exit 1 Evidence gap ×1 1.5.1 executionContext=node · moduleSystem=cjs · os=linux · runtime=node@22.23 sha256:223705e02a51…ReferenceError: __dirname is not defined · at get version (fil<path>:<n>:<n>) · at main (<path>:<n>:<n>) · at Object.<anonymous> (<path>:<n>:<n>)node · unclassified-diagnostic · outer node · gap stage-unknownEvidence quality: complete · Environment variants: 1 · First recorded: 2026-09-03 · Last seen: 2026-09-03Diagnostic re-verification candidate
-
observed UNKNOWN exit 1 ERR_AMBIGUOUS_MODULE_SYNTAX Evidence gap ×1 1.5.1 executionContext=node · moduleSystem=cjs · os=linux · runtime=node@22.23 sha256:2e857e4a17a1…fil<path>:<n> · const { version } = JSON.parse(readFileSync(join(__dirname, <str>), <str>)); · ^ …node · unclassified-diagnostic · outer node · gap stage-unknownEvidence quality: complete · Environment variants: 1 · First recorded: 2026-09-03 · Last seen: 2026-09-03Diagnostic re-verification candidate
Showing the 12 most-reported of 31 recorded failure clusters. The rest are single reports.