Recordsnpm@jridgewell/sourcemap-codec1.6.0
Change the conditions
Current conditions
@jridgewell/sourcemap-codec @1.6.0ubuntu glibc · x64 · node 22 · npm 10 · node
package-level total, not an API
0 of 99 passed
Verified — this network ran a contract at this coordinate.
there is a sample here, and our run of it at this coordinate failed
- Project observations
- 437 / 440
- Contract verifications
- 0 / 99
- Usage records
- 152
- Independent reporting peers
- 3
- Last recorded
- 2026-09-17
Evidence you can open
Dependency Health
A resolution read this release's tree and found no dependencies. That is a measurement, not a missing one.
Recent failure clusters
-
observed PROCESS_START process start failed Evidence gap ×20 1.5.5 → 1.6.0 executionContext=node sha256:c12549970456…· structured-termination · gap diagnostic-missingEvidence quality: partial · Environment variants: 3 · First recorded: 2026-08-29 · Last seen: 2026-09-16Diagnostic re-verification candidate
-
observed UNKNOWN exit 1 Evidence gap ×13 1.5.5 → 1.6.0 executionContext=node · moduleSystem=cjs · os=linux · runtime=node@22.23 sha256:91ad26545eb1…node:internal/modules/cjs/loader:<n> · throw err; · ^ · Error: Cannot find module <str>node · unclassified-diagnostic · outer node · gap stage-unknownEvidence quality: complete · Environment variants: 1 · First recorded: 2026-08-29 · Last seen: 2026-09-05Diagnostic re-verification candidate
-
observed UNKNOWN exit 1 ERR_MODULE_NOT_FOUND Evidence gap ×11 1.5.5 → 1.6.0 executionContext=node · moduleSystem=cjs · os=linux · runtime=node@22.23 sha256:88af852f99a8…node:internal/modules/package_json_reader:<n> · throw new ERR_MODULE_NOT_FOUND(packageName, fileURLToPath(base), null); · ^ …node · unclassified-diagnostic · outer node · gap stage-unknownEvidence quality: complete · Environment variants: 1 · First recorded: 2026-08-29 · Last seen: 2026-09-05Diagnostic re-verification candidate
-
observed UNKNOWN exit 1 ERR_ASSERTION Evidence gap ×9 1.5.5 → 1.6.0 executionContext=node · os=linux · runtime=node@22.23 sha256:986d98189e70…node:internal/modules/run_main:<n> · triggerUncaughtException( · ^ · AssertionError [ERR_ASSERTION]: Expected values to be strictly equal:node · unclassified-diagnostic · outer node · gap stage-unknownEvidence quality: complete · Environment variants: 2 · First recorded: 2026-08-29 · Last seen: 2026-09-05Diagnostic re-verification candidate
-
observed UNKNOWN exit 1 ERR_ASSERTION Evidence gap ×6 1.5.5 → 1.6.0 executionContext=node · os=linux · runtime=node@22.23 sha256:43caf7a060e7…node:internal/modules/run_main:<n> · triggerUncaughtException( · ^ · AssertionError [ERR_ASSERTION]: Expected values to be strictly deep-equal:node · unclassified-diagnostic · outer node · gap stage-unknownEvidence quality: complete · Environment variants: 2 · First recorded: 2026-08-31 · Last seen: 2026-09-03Diagnostic re-verification candidate
-
observed UNKNOWN exit 1 Evidence gap ×5 1.5.5 → 1.6.0 executionContext=node · moduleSystem=cjs · os=linux · runtime=node@22.23 sha256:72ba2d1e946f…<path>: No module named pippython3 · unclassified-diagnostic · outer python3 · gap stage-unknownEvidence quality: complete · Environment variants: 1 · First recorded: 2026-08-31 · Last seen: 2026-08-31Diagnostic re-verification candidate
-
observed UNKNOWN exit 1 Evidence gap ×4 1.6.0 executionContext=node · moduleSystem=cjs · os=linux · runtime=node@22.23 sha256:3b3190f2cd44…doc: cannot find package <str> in any of: · ($GOROOT not set) · <path> (from $GOPATH)go · unclassified-diagnostic · outer go · gap stage-unknownEvidence quality: complete · Environment variants: 1 · First recorded: 2026-09-04 · Last seen: 2026-09-05Diagnostic re-verification candidate
-
observed UNKNOWN exit 1 Evidence gap ×3 1.6.0 executionContext=node · moduleSystem=esm · os=linux · runtime=node@22.23 sha256:8fd30f2a6304…fil<path>:<n> · throw new Error(errorMsg); · ^ · Error: Vitest failed to access its internal state.node · unclassified-diagnostic · outer node · gap stage-unknownEvidence quality: complete · Environment variants: 1 · First recorded: 2026-08-31 · Last seen: 2026-09-08Diagnostic re-verification candidate
-
observed UNKNOWN exit 1 ERR_PACKAGE_PATH_NOT_EXPORTED Evidence gap ×2 1.6.0 executionContext=node · moduleSystem=esm · os=linux · runtime=node@22.23 sha256:b9a7518ba7bb…node:internal/modules/esm/resolve:<n> · return new ERR_PACKAGE_PATH_NOT_EXPORTED( · ^ …node · unclassified-diagnostic · outer node · gap stage-unknownEvidence quality: complete · Environment variants: 1 · First recorded: 2026-09-01 · Last seen: 2026-09-01Diagnostic re-verification candidate
-
observed UNKNOWN exit 1 Evidence gap ×2 1.6.0 executionContext=node · moduleSystem=esm · os=linux · runtime=node@22.23 sha256:455451e1a14e…<url>]:<n> · import babel from <str>; · ^^^^^ · SyntaxError: The requested module <str> does not provide an export named <str>node · unclassified-diagnostic · outer node · gap stage-unknownEvidence quality: complete · Environment variants: 1 · First recorded: 2026-09-02 · Last seen: 2026-09-05Diagnostic re-verification candidate
-
observed UNKNOWN exit 1 Evidence gap ×2 1.6.0 executionContext=node · moduleSystem=cjs · os=linux · runtime=node@22.23 sha256:56bc1af5426b…evalmachine.<anonymous>:<n> · }), e && babelHelpers.setPrototypeOf(t, e); · ^ · TypeError: babelHelpers.setPrototypeOf is not a functionnode · unclassified-diagnostic · outer node · gap stage-unknownEvidence quality: complete · Environment variants: 1 · First recorded: 2026-09-03 · Last seen: 2026-09-03Diagnostic re-verification candidate
-
observed UNKNOWN exit 1 Evidence gap ×2 1.6.0 executionContext=node · moduleSystem=cjs · os=linux · runtime=node@22.23 sha256:f0288eb0529f…Traceback (most recent call last): · File <str>, line 19, in <module> · AssertionError· unclassified-diagnostic · gap stage-unknownEvidence quality: complete · Environment variants: 1 · First recorded: 2026-09-04 · Last seen: 2026-09-04Diagnostic re-verification candidate
Showing the 12 most-reported of 67 recorded failure clusters. The rest are single reports.