Aufzeichnungennpm@jridgewell/sourcemap-codec1.6.0
Bedingungen ändern
Aktuelle Bedingungen
@jridgewell/sourcemap-codec @1.6.0ubuntu glibc · x64 · node 22 · npm 10 · node
Paketsumme, keine API
0 von 99 bestanden
Verifiziert — dieses Netzwerk hat an dieser Koordinate einen Contract ausgeführt.
hier gibt es ein Sample, und unser Lauf an dieser Koordinate ist fehlgeschlagen
- Projektbeobachtungen
- 437 / 440
- Contract-Verifikationen
- 0 / 99
- Nutzungsdatensätze
- 152
- Unabhängig meldende Peers
- 3
- Zuletzt erfasst
- 2026-09-17
Nachweise zum Öffnen
Abhängigkeits-Zustand
Eine Auflösung hat den Baum dieses Releases gelesen und keine Abhängigkeiten gefunden. Das ist eine Messung, keine fehlende.
Aktuelle Fehler-Cluster
-
beobachtet PROCESS_START process start failed Beweislücke ×20 1.5.5 → 1.6.0 executionContext=node sha256:c12549970456…· structured-termination · gap diagnostic-missingBeweisqualität: partial · Umgebungsvarianten: 3 · Zuerst erfasst: 2026-08-29 · Zuletzt gesehen: 2026-09-16Kandidat für diagnostische Neuprüfung
-
beobachtet UNKNOWN exit 1 Beweislücke ×13 1.5.5 → 1.6.0 executionContext=node · moduleSystem=cjs · os=linux · runtime=node@22.23 sha256:91ad26545eb1…node:internal/modules/cjs/loader:<n> · throw err; · ^ · Error: Cannot find module <str>node · unclassified-diagnostic · outer node · gap stage-unknownBeweisqualität: complete · Umgebungsvarianten: 1 · Zuerst erfasst: 2026-08-29 · Zuletzt gesehen: 2026-09-05Kandidat für diagnostische Neuprüfung
-
beobachtet UNKNOWN exit 1 ERR_MODULE_NOT_FOUND Beweislücke ×11 1.5.5 → 1.6.0 executionContext=node · moduleSystem=cjs · os=linux · runtime=node@22.23 sha256:88af852f99a8…node:internal/modules/package_json_reader:<n> · throw new ERR_MODULE_NOT_FOUND(packageName, fileURLToPath(base), null); · ^ …node · unclassified-diagnostic · outer node · gap stage-unknownBeweisqualität: complete · Umgebungsvarianten: 1 · Zuerst erfasst: 2026-08-29 · Zuletzt gesehen: 2026-09-05Kandidat für diagnostische Neuprüfung
-
beobachtet UNKNOWN exit 1 ERR_ASSERTION Beweislücke ×9 1.5.5 → 1.6.0 executionContext=node · os=linux · runtime=node@22.23 sha256:986d98189e70…node:internal/modules/run_main:<n> · triggerUncaughtException( · ^ · AssertionError [ERR_ASSERTION]: Expected values to be strictly equal:node · unclassified-diagnostic · outer node · gap stage-unknownBeweisqualität: complete · Umgebungsvarianten: 2 · Zuerst erfasst: 2026-08-29 · Zuletzt gesehen: 2026-09-05Kandidat für diagnostische Neuprüfung
-
beobachtet UNKNOWN exit 1 ERR_ASSERTION Beweislücke ×6 1.5.5 → 1.6.0 executionContext=node · os=linux · runtime=node@22.23 sha256:43caf7a060e7…node:internal/modules/run_main:<n> · triggerUncaughtException( · ^ · AssertionError [ERR_ASSERTION]: Expected values to be strictly deep-equal:node · unclassified-diagnostic · outer node · gap stage-unknownBeweisqualität: complete · Umgebungsvarianten: 2 · Zuerst erfasst: 2026-08-31 · Zuletzt gesehen: 2026-09-03Kandidat für diagnostische Neuprüfung
-
beobachtet UNKNOWN exit 1 Beweislücke ×5 1.5.5 → 1.6.0 executionContext=node · moduleSystem=cjs · os=linux · runtime=node@22.23 sha256:72ba2d1e946f…<path>: No module named pippython3 · unclassified-diagnostic · outer python3 · gap stage-unknownBeweisqualität: complete · Umgebungsvarianten: 1 · Zuerst erfasst: 2026-08-31 · Zuletzt gesehen: 2026-08-31Kandidat für diagnostische Neuprüfung
-
beobachtet UNKNOWN exit 1 Beweislücke ×4 1.6.0 executionContext=node · moduleSystem=cjs · os=linux · runtime=node@22.23 sha256:3b3190f2cd44…doc: cannot find package <str> in any of: · ($GOROOT not set) · <path> (from $GOPATH)go · unclassified-diagnostic · outer go · gap stage-unknownBeweisqualität: complete · Umgebungsvarianten: 1 · Zuerst erfasst: 2026-09-04 · Zuletzt gesehen: 2026-09-05Kandidat für diagnostische Neuprüfung
-
beobachtet UNKNOWN exit 1 Beweislücke ×3 1.6.0 executionContext=node · moduleSystem=esm · os=linux · runtime=node@22.23 sha256:8fd30f2a6304…fil<path>:<n> · throw new Error(errorMsg); · ^ · Error: Vitest failed to access its internal state.node · unclassified-diagnostic · outer node · gap stage-unknownBeweisqualität: complete · Umgebungsvarianten: 1 · Zuerst erfasst: 2026-08-31 · Zuletzt gesehen: 2026-09-08Kandidat für diagnostische Neuprüfung
-
beobachtet UNKNOWN exit 1 ERR_PACKAGE_PATH_NOT_EXPORTED Beweislücke ×2 1.6.0 executionContext=node · moduleSystem=esm · os=linux · runtime=node@22.23 sha256:b9a7518ba7bb…node:internal/modules/esm/resolve:<n> · return new ERR_PACKAGE_PATH_NOT_EXPORTED( · ^ …node · unclassified-diagnostic · outer node · gap stage-unknownBeweisqualität: complete · Umgebungsvarianten: 1 · Zuerst erfasst: 2026-09-01 · Zuletzt gesehen: 2026-09-01Kandidat für diagnostische Neuprüfung
-
beobachtet UNKNOWN exit 1 Beweislücke ×2 1.6.0 executionContext=node · moduleSystem=esm · os=linux · runtime=node@22.23 sha256:455451e1a14e…<url>]:<n> · import babel from <str>; · ^^^^^ · SyntaxError: The requested module <str> does not provide an export named <str>node · unclassified-diagnostic · outer node · gap stage-unknownBeweisqualität: complete · Umgebungsvarianten: 1 · Zuerst erfasst: 2026-09-02 · Zuletzt gesehen: 2026-09-05Kandidat für diagnostische Neuprüfung
-
beobachtet UNKNOWN exit 1 Beweislücke ×2 1.6.0 executionContext=node · moduleSystem=cjs · os=linux · runtime=node@22.23 sha256:56bc1af5426b…evalmachine.<anonymous>:<n> · }), e && babelHelpers.setPrototypeOf(t, e); · ^ · TypeError: babelHelpers.setPrototypeOf is not a functionnode · unclassified-diagnostic · outer node · gap stage-unknownBeweisqualität: complete · Umgebungsvarianten: 1 · Zuerst erfasst: 2026-09-03 · Zuletzt gesehen: 2026-09-03Kandidat für diagnostische Neuprüfung
-
beobachtet UNKNOWN exit 1 Beweislücke ×2 1.6.0 executionContext=node · moduleSystem=cjs · os=linux · runtime=node@22.23 sha256:f0288eb0529f…Traceback (most recent call last): · File <str>, line 19, in <module> · AssertionError· unclassified-diagnostic · gap stage-unknownBeweisqualität: complete · Umgebungsvarianten: 1 · Zuerst erfasst: 2026-09-04 · Zuletzt gesehen: 2026-09-04Kandidat für diagnostische Neuprüfung
Es werden die 12 meistgemeldeten von 67 aufgezeichneten Fehlerclustern gezeigt. Der Rest sind Einzelmeldungen.