Relevésnpm@inquirer/type2.0.0
Changer les conditions
Conditions actuelles
@inquirer/type @2.0.0debian glibc · x64 · node 22 · npm · node
total du paquet, pas une API
Enregistré comme présent dans des projets. Rien n'a été exécuté à cette coordonnée.
Observé — de vrais builds de projets ont fait remonter cette coordonnée.
pas encore d'échantillon à cette coordonnée
- Observations de projets
- rien à cette coordonnée
- Vérifications de contrat
- rien à cette coordonnée
- Enregistrements d'usage
- 6
- Pairs rapporteurs indépendants
- 1
- Dernier enregistrement
- 2026-09-17
Santé des dépendances
Combinaisons observées et preuves d'échec pour cette version
Premier échec observé
2.0.0
linux · node@22.23 · moduleSystem=esm · executionContext=node
1 FAIL
· stage: UNKNOWN
· fingerprint: sha256:4a939d00eec492b9a03b26b042fb8a8194c85e6b0782361ef967eb9b259f03ba
| Bibliothèque | Version | Santé | Mesuré là-bas | Projets |
|---|---|---|---|---|
| mute-stream | 1.0.0 | PASS Toutes les observations ont réussi | contrat réussi | 20 jours-projet |
La colonne de mesure porte sur la version de chaque dépendance elle-même, pas sur la paire. Qu'un résolveur ait placé deux versions côte à côte ne prouve pas qu'elles fonctionnent ensemble.
Clusters d'échecs récents
-
observé UNKNOWN exit 13 Lacune de preuve ×1 2.0.0 executionContext=node · moduleSystem=esm · os=linux · runtime=node@22.23 sha256:4a939d00eec4…Warning: Detected unsettled top-level await at <url>]:<n> · const ans = await promptPromise; · ^ · fil<path>:<n>node · unclassified-diagnostic · outer node · gap stage-unknownQualité de preuve: complete · Variantes d’environnement: 1 · Premier relevé: 2026-09-16 · Dernière observation: 2026-09-16Candidat à une revérification diagnostique
-
observé UNKNOWN exit 1 ERR_ASSERTION Lacune de preuve ×1 2.0.0 executionContext=node · moduleSystem=cjs · os=linux · runtime=node@22.23 sha256:b12460008ca6…Test failed: AssertionError [ERR_ASSERTION]: Expected values to be strictly equal: · true !== false · at runTests (<url>) · at <url>node · unclassified-diagnostic · outer node · gap stage-unknownQualité de preuve: complete · Variantes d’environnement: 1 · Premier relevé: 2026-09-16 · Dernière observation: 2026-09-16Candidat à une revérification diagnostique
-
observé UNKNOWN exit 1 Lacune de preuve ×1 2.0.0 executionContext=node · moduleSystem=cjs · os=linux · runtime=node@22.23 sha256:c0573fd829b8…<url> · import confirm, { promptConfirm } from <str>; · ^^^^^^^ · SyntaxError: The requested module <str> does not provide an export named <str>node · unclassified-diagnostic · outer node · gap stage-unknownQualité de preuve: complete · Variantes d’environnement: 1 · Premier relevé: 2026-09-16 · Dernière observation: 2026-09-16Candidat à une revérification diagnostique
-
observé UNKNOWN exit 1 ERR_ASSERTION Lacune de preuve ×1 2.0.0 executionContext=node · moduleSystem=cjs · os=linux · runtime=node@22.23 sha256:deb29d18a641…Test failed: AssertionError [ERR_ASSERTION]: Expected values to be strictly equal: · + actual - expected · + <str> · - <str>node · unclassified-diagnostic · outer node · gap stage-unknownQualité de preuve: complete · Variantes d’environnement: 1 · Premier relevé: 2026-09-16 · Dernière observation: 2026-09-16Candidat à une revérification diagnostique
-
observé UNKNOWN exit 1 ERR_ASSERTION Lacune de preuve ×1 2.0.0 executionContext=node · moduleSystem=esm · os=linux · runtime=node@22.23 sha256:eff444dbb236…Contract test failure: AssertionError [ERR_ASSERTION]: Plain object should not be identified as Separator · true !== false · at testSeparator (<url>) …node · unclassified-diagnostic · outer node · gap stage-unknownQualité de preuve: complete · Variantes d’environnement: 1 · Premier relevé: 2026-09-16 · Dernière observation: 2026-09-16Candidat à une revérification diagnostique