记录npm@inquirer/core9.2.1@inquirer/core.ValidationError
更改条件
依赖健康度
此版本的依赖组合与失败观测
观测到问题 1 项 ·
正常 13 项
| 库 | 版本 | 健康状态 | 在那里测得 | 项目 |
|---|---|---|---|---|
| @inquirer/figures | 1.0.15 | PASS 所有观测均通过 | 契约通过 | 21 个项目日 |
| @inquirer/type | 2.0.0 | PASS 所有观测均通过 | 契约通过 | 21 个项目日 |
| @types/mute-stream | 0.0.4 | PASS 所有观测均通过 | 契约通过 | 21 个项目日 |
| @types/node | 22.20.2 | PASS 所有观测均通过 | 契约通过 | 11 个项目日 |
| @types/node | 22.20.3 | PASS 所有观测均通过 | 契约通过 | 10 个项目日 |
| @types/wrap-ansi | 3.0.0 | PASS 所有观测均通过 | 契约通过 | 21 个项目日 |
| ansi-escapes | 4.3.2 | PASS 所有观测均通过 | 契约通过 | 21 个项目日 |
| cli-width | 4.1.0 | PASS 所有观测均通过 | 契约通过 | 21 个项目日 |
| mute-stream | 1.0.0 | PASS 所有观测均通过 | 契约通过 | 20 个项目日 |
| signal-exit | 4.1.0 | PASS 所有观测均通过 | 契约通过 | 21 个项目日 |
| strip-ansi | 6.0.1 | PASS 所有观测均通过 | 契约通过 | 21 个项目日 |
| wrap-ansi | 6.2.0 | PASS 所有观测均通过 | 契约通过 | 20 个项目日 |
| yoctocolors-cjs | 2.1.3 | PASS 所有观测均通过 | 契约通过 | 21 个项目日 |
测量列说的是每个依赖自身版本的情况,而不是这一对的情况。解析器把两个版本放在一起,并不证明它们能协同工作。
近期失败聚类
-
已观测 UNKNOWN exit 13 证据缺口 ×1 9.2.1 executionContext=node · moduleSystem=esm · os=linux · runtime=node@22.23 sha256:4a939d00eec4…Warning: Detected unsettled top-level await at <url>]:<n> · const ans = await promptPromise; · ^ · fil<path>:<n>node · unclassified-diagnostic · outer node · gap stage-unknown证据质量: complete · 环境变体: 1 · 首次记录: 2026-09-16 · 最近观测: 2026-09-16诊断复验候选
-
已观测 UNKNOWN exit 1 ERR_ASSERTION 证据缺口 ×1 9.2.1 executionContext=node · moduleSystem=cjs · os=linux · runtime=node@22.23 @inquirer/core.ValidationError sha256:b12460008ca6…Test failed: AssertionError [ERR_ASSERTION]: Expected values to be strictly equal: · true !== false · at runTests (<url>) · at <url>node · unclassified-diagnostic · outer node · gap stage-unknown证据质量: complete · 环境变体: 1 · 首次记录: 2026-09-16 · 最近观测: 2026-09-16诊断复验候选
-
已观测 UNKNOWN exit 1 证据缺口 ×1 9.2.1 executionContext=node · moduleSystem=cjs · os=linux · runtime=node@22.23 sha256:c0573fd829b8…<url> · import confirm, { promptConfirm } from <str>; · ^^^^^^^ · SyntaxError: The requested module <str> does not provide an export named <str>node · unclassified-diagnostic · outer node · gap stage-unknown证据质量: complete · 环境变体: 1 · 首次记录: 2026-09-16 · 最近观测: 2026-09-16诊断复验候选
-
已观测 UNKNOWN exit 1 ERR_ASSERTION 证据缺口 ×1 9.2.1 executionContext=node · moduleSystem=cjs · os=linux · runtime=node@22.23 @inquirer/core.ValidationError sha256:deb29d18a641…Test failed: AssertionError [ERR_ASSERTION]: Expected values to be strictly equal: · + actual - expected · + <str> · - <str>node · unclassified-diagnostic · outer node · gap stage-unknown证据质量: complete · 环境变体: 1 · 首次记录: 2026-09-16 · 最近观测: 2026-09-16诊断复验候选
-
已观测 UNKNOWN exit 1 ERR_ASSERTION 证据缺口 ×1 9.2.1 executionContext=node · moduleSystem=esm · os=linux · runtime=node@22.23 sha256:eff444dbb236…Contract test failure: AssertionError [ERR_ASSERTION]: Plain object should not be identified as Separator · true !== false · at testSeparator (<url>) …node · unclassified-diagnostic · outer node · gap stage-unknown证据质量: complete · 环境变体: 1 · 首次记录: 2026-09-16 · 最近观测: 2026-09-16诊断复验候选