Recordsnpm@inquirer/core9.2.1@inquirer/core.ExitPromptError
Change the conditions
Current conditions
@inquirer/core.ExitPromptError @9.2.1ubuntu glibc · x64 · node 22 · npm 10 · node
0 of 2 passed
Verified — this network ran a contract at this coordinate.
there is a sample here, and our run of it at this coordinate failed
- Project observations
- 2 / 2
- Contract verifications
- 0 / 2
- Independent reporting peers
- 1
- Last recorded
- 2026-09-16
Evidence you can open
Dependency Health
Observed combinations and failure evidence for this release
Observed problems 1 ·
Steady 13
First observed break
9.2.1
linux · node@22.23 · moduleSystem=esm · executionContext=node
1 FAIL
· stage: UNKNOWN
· fingerprint: sha256:4a939d00eec492b9a03b26b042fb8a8194c85e6b0782361ef967eb9b259f03ba
| Library | Version | Health | Measured there | Projects |
|---|---|---|---|---|
| @inquirer/figures | 1.0.15 | PASS All observations passed | contract passed | 21 project-days |
| @inquirer/type | 2.0.0 | PASS All observations passed | contract passed | 21 project-days |
| @types/mute-stream | 0.0.4 | PASS All observations passed | contract passed | 21 project-days |
| @types/node | 22.20.2 | PASS All observations passed | contract passed | 11 project-days |
| @types/node | 22.20.3 | PASS All observations passed | contract passed | 10 project-days |
| @types/wrap-ansi | 3.0.0 | PASS All observations passed | contract passed | 21 project-days |
| ansi-escapes | 4.3.2 | PASS All observations passed | contract passed | 21 project-days |
| cli-width | 4.1.0 | PASS All observations passed | contract passed | 21 project-days |
| mute-stream | 1.0.0 | PASS All observations passed | contract passed | 20 project-days |
| signal-exit | 4.1.0 | PASS All observations passed | contract passed | 21 project-days |
| strip-ansi | 6.0.1 | PASS All observations passed | contract passed | 21 project-days |
| wrap-ansi | 6.2.0 | PASS All observations passed | contract passed | 20 project-days |
| yoctocolors-cjs | 2.1.3 | PASS All observations passed | contract passed | 21 project-days |
The measured column is about each dependency's own release, not about the pair. A resolver placing two releases side by side is not evidence that they work together.
Recent failure clusters
-
observed UNKNOWN exit 13 Evidence gap ×1 9.2.1 executionContext=node · moduleSystem=esm · os=linux · runtime=node@22.23 sha256:4a939d00eec4…Warning: Detected unsettled top-level await at <url>]:<n> · const ans = await promptPromise; · ^ · fil<path>:<n>node · unclassified-diagnostic · outer node · gap stage-unknownEvidence quality: complete · Environment variants: 1 · First recorded: 2026-09-16 · Last seen: 2026-09-16Diagnostic re-verification candidate
-
observed UNKNOWN exit 1 ERR_ASSERTION Evidence gap ×1 9.2.1 executionContext=node · moduleSystem=cjs · os=linux · runtime=node@22.23 @inquirer/core.ExitPromptError sha256:b12460008ca6…Test failed: AssertionError [ERR_ASSERTION]: Expected values to be strictly equal: · true !== false · at runTests (<url>) · at <url>node · unclassified-diagnostic · outer node · gap stage-unknownEvidence quality: complete · Environment variants: 1 · First recorded: 2026-09-16 · Last seen: 2026-09-16Diagnostic re-verification candidate
-
observed UNKNOWN exit 1 Evidence gap ×1 9.2.1 executionContext=node · moduleSystem=cjs · os=linux · runtime=node@22.23 sha256:c0573fd829b8…<url> · import confirm, { promptConfirm } from <str>; · ^^^^^^^ · SyntaxError: The requested module <str> does not provide an export named <str>node · unclassified-diagnostic · outer node · gap stage-unknownEvidence quality: complete · Environment variants: 1 · First recorded: 2026-09-16 · Last seen: 2026-09-16Diagnostic re-verification candidate
-
observed UNKNOWN exit 1 ERR_ASSERTION Evidence gap ×1 9.2.1 executionContext=node · moduleSystem=cjs · os=linux · runtime=node@22.23 @inquirer/core.ExitPromptError sha256:deb29d18a641…Test failed: AssertionError [ERR_ASSERTION]: Expected values to be strictly equal: · + actual - expected · + <str> · - <str>node · unclassified-diagnostic · outer node · gap stage-unknownEvidence quality: complete · Environment variants: 1 · First recorded: 2026-09-16 · Last seen: 2026-09-16Diagnostic re-verification candidate
-
observed UNKNOWN exit 1 ERR_ASSERTION Evidence gap ×1 9.2.1 executionContext=node · moduleSystem=esm · os=linux · runtime=node@22.23 sha256:eff444dbb236…Contract test failure: AssertionError [ERR_ASSERTION]: Plain object should not be identified as Separator · true !== false · at testSeparator (<url>) …node · unclassified-diagnostic · outer node · gap stage-unknownEvidence quality: complete · Environment variants: 1 · First recorded: 2026-09-16 · Last seen: 2026-09-16Diagnostic re-verification candidate