Registrosnpm@inquirer/core9.2.1@inquirer/core.CancelPromptError
Mudar as condições
Condições atuais
@inquirer/core.CancelPromptError @9.2.1ubuntu glibc · x64 · node 22 · npm 10 · node
0 de 2 passaram
Verificado — esta rede executou um contrato nesta coordenada.
há uma amostra aqui e nossa execução nesta coordenada falhou (1)
- Observações de projetos
- 4 / 4
- Verificações de contrato
- 0 / 2
- Peers independentes que reportaram
- 1
- Último registro
- 2026-09-16
Evidências que você pode abrir
Saúde das dependências
Combinações observadas e evidências de falha para esta versão
Problemas observados: 1 ·
Estáveis: 13
Primeira quebra observada
9.2.1
linux · node@22.23 · moduleSystem=esm · executionContext=node
1 FAIL
· stage: UNKNOWN
· fingerprint: sha256:4a939d00eec492b9a03b26b042fb8a8194c85e6b0782361ef967eb9b259f03ba
| Biblioteca | Versão | Saúde | Medido ali | Projetos |
|---|---|---|---|---|
| @inquirer/figures | 1.0.15 | PASS Todas as observações passaram | contrato aprovado | 21 dias-projeto |
| @inquirer/type | 2.0.0 | PASS Todas as observações passaram | contrato aprovado | 21 dias-projeto |
| @types/mute-stream | 0.0.4 | PASS Todas as observações passaram | contrato aprovado | 21 dias-projeto |
| @types/node | 22.20.2 | PASS Todas as observações passaram | contrato aprovado | 11 dias-projeto |
| @types/node | 22.20.3 | PASS Todas as observações passaram | contrato aprovado | 10 dias-projeto |
| @types/wrap-ansi | 3.0.0 | PASS Todas as observações passaram | contrato aprovado | 21 dias-projeto |
| ansi-escapes | 4.3.2 | PASS Todas as observações passaram | contrato aprovado | 21 dias-projeto |
| cli-width | 4.1.0 | PASS Todas as observações passaram | contrato aprovado | 21 dias-projeto |
| mute-stream | 1.0.0 | PASS Todas as observações passaram | contrato aprovado | 20 dias-projeto |
| signal-exit | 4.1.0 | PASS Todas as observações passaram | contrato aprovado | 21 dias-projeto |
| strip-ansi | 6.0.1 | PASS Todas as observações passaram | contrato aprovado | 21 dias-projeto |
| wrap-ansi | 6.2.0 | PASS Todas as observações passaram | contrato aprovado | 20 dias-projeto |
| yoctocolors-cjs | 2.1.3 | PASS Todas as observações passaram | contrato aprovado | 21 dias-projeto |
A coluna de medição é sobre a versão de cada dependência em si, não sobre o par. Um resolvedor ter colocado duas versões lado a lado não é prova de que funcionam juntas.
Clusters de falha recentes
-
observado UNKNOWN exit 13 Lacuna de evidência ×1 9.2.1 executionContext=node · moduleSystem=esm · os=linux · runtime=node@22.23 sha256:4a939d00eec4…Warning: Detected unsettled top-level await at <url>]:<n> · const ans = await promptPromise; · ^ · fil<path>:<n>node · unclassified-diagnostic · outer node · gap stage-unknownQualidade da evidência: complete · Variantes de ambiente: 1 · Primeiro registro: 2026-09-16 · Visto por último: 2026-09-16Candidato a reverificação diagnóstica
-
observado UNKNOWN exit 1 ERR_ASSERTION Lacuna de evidência ×1 9.2.1 executionContext=node · moduleSystem=cjs · os=linux · runtime=node@22.23 @inquirer/core.CancelPromptError sha256:b12460008ca6…Test failed: AssertionError [ERR_ASSERTION]: Expected values to be strictly equal: · true !== false · at runTests (<url>) · at <url>node · unclassified-diagnostic · outer node · gap stage-unknownQualidade da evidência: complete · Variantes de ambiente: 1 · Primeiro registro: 2026-09-16 · Visto por último: 2026-09-16Candidato a reverificação diagnóstica
-
observado UNKNOWN exit 1 Lacuna de evidência ×1 9.2.1 executionContext=node · moduleSystem=cjs · os=linux · runtime=node@22.23 sha256:c0573fd829b8…<url> · import confirm, { promptConfirm } from <str>; · ^^^^^^^ · SyntaxError: The requested module <str> does not provide an export named <str>node · unclassified-diagnostic · outer node · gap stage-unknownQualidade da evidência: complete · Variantes de ambiente: 1 · Primeiro registro: 2026-09-16 · Visto por último: 2026-09-16Candidato a reverificação diagnóstica
-
observado UNKNOWN exit 1 ERR_ASSERTION Lacuna de evidência ×1 9.2.1 executionContext=node · moduleSystem=cjs · os=linux · runtime=node@22.23 @inquirer/core.CancelPromptError sha256:deb29d18a641…Test failed: AssertionError [ERR_ASSERTION]: Expected values to be strictly equal: · + actual - expected · + <str> · - <str>node · unclassified-diagnostic · outer node · gap stage-unknownQualidade da evidência: complete · Variantes de ambiente: 1 · Primeiro registro: 2026-09-16 · Visto por último: 2026-09-16Candidato a reverificação diagnóstica
-
observado UNKNOWN exit 1 ERR_ASSERTION Lacuna de evidência ×1 9.2.1 executionContext=node · moduleSystem=esm · os=linux · runtime=node@22.23 sha256:eff444dbb236…Contract test failure: AssertionError [ERR_ASSERTION]: Plain object should not be identified as Separator · true !== false · at testSeparator (<url>) …node · unclassified-diagnostic · outer node · gap stage-unknownQualidade da evidência: complete · Variantes de ambiente: 1 · Primeiro registro: 2026-09-16 · Visto por último: 2026-09-16Candidato a reverificação diagnóstica