Relevésnpm@inquirer/core9.2.1@inquirer/core.AbortPromptError
Changer les conditions
Conditions actuelles
@inquirer/core.AbortPromptError @9.2.1ubuntu glibc · x64 · node 22 · npm 10 · node
0 sur 2 ont réussi
Vérifié — ce réseau a exécuté un contrat à cette coordonnée.
il y a un échantillon ici et notre exécution à cette coordonnée a échoué (1)
- Observations de projets
- 2 / 2
- Vérifications de contrat
- 0 / 2
- Pairs rapporteurs indépendants
- 1
- Dernier enregistrement
- 2026-09-16
Preuves que vous pouvez ouvrir
Santé des dépendances
Combinaisons observées et preuves d'échec pour cette version
Problèmes observés : 1 ·
Stable(s) : 13
Premier échec observé
9.2.1
linux · node@22.23 · moduleSystem=esm · executionContext=node
1 FAIL
· stage: UNKNOWN
· fingerprint: sha256:4a939d00eec492b9a03b26b042fb8a8194c85e6b0782361ef967eb9b259f03ba
| Bibliothèque | Version | Santé | Mesuré là-bas | Projets |
|---|---|---|---|---|
| @inquirer/figures | 1.0.15 | PASS Toutes les observations ont réussi | contrat réussi | 21 jours-projet |
| @inquirer/type | 2.0.0 | PASS Toutes les observations ont réussi | contrat réussi | 21 jours-projet |
| @types/mute-stream | 0.0.4 | PASS Toutes les observations ont réussi | contrat réussi | 21 jours-projet |
| @types/node | 22.20.2 | PASS Toutes les observations ont réussi | contrat réussi | 11 jours-projet |
| @types/node | 22.20.3 | PASS Toutes les observations ont réussi | contrat réussi | 10 jours-projet |
| @types/wrap-ansi | 3.0.0 | PASS Toutes les observations ont réussi | contrat réussi | 21 jours-projet |
| ansi-escapes | 4.3.2 | PASS Toutes les observations ont réussi | contrat réussi | 21 jours-projet |
| cli-width | 4.1.0 | PASS Toutes les observations ont réussi | contrat réussi | 21 jours-projet |
| mute-stream | 1.0.0 | PASS Toutes les observations ont réussi | contrat réussi | 20 jours-projet |
| signal-exit | 4.1.0 | PASS Toutes les observations ont réussi | contrat réussi | 21 jours-projet |
| strip-ansi | 6.0.1 | PASS Toutes les observations ont réussi | contrat réussi | 21 jours-projet |
| wrap-ansi | 6.2.0 | PASS Toutes les observations ont réussi | contrat réussi | 20 jours-projet |
| yoctocolors-cjs | 2.1.3 | PASS Toutes les observations ont réussi | contrat réussi | 21 jours-projet |
La colonne de mesure porte sur la version de chaque dépendance elle-même, pas sur la paire. Qu'un résolveur ait placé deux versions côte à côte ne prouve pas qu'elles fonctionnent ensemble.
Clusters d'échecs récents
-
observé UNKNOWN exit 13 Lacune de preuve ×1 9.2.1 executionContext=node · moduleSystem=esm · os=linux · runtime=node@22.23 sha256:4a939d00eec4…Warning: Detected unsettled top-level await at <url>]:<n> · const ans = await promptPromise; · ^ · fil<path>:<n>node · unclassified-diagnostic · outer node · gap stage-unknownQualité de preuve: complete · Variantes d’environnement: 1 · Premier relevé: 2026-09-16 · Dernière observation: 2026-09-16Candidat à une revérification diagnostique
-
observé UNKNOWN exit 1 ERR_ASSERTION Lacune de preuve ×1 9.2.1 executionContext=node · moduleSystem=cjs · os=linux · runtime=node@22.23 @inquirer/core.AbortPromptError sha256:b12460008ca6…Test failed: AssertionError [ERR_ASSERTION]: Expected values to be strictly equal: · true !== false · at runTests (<url>) · at <url>node · unclassified-diagnostic · outer node · gap stage-unknownQualité de preuve: complete · Variantes d’environnement: 1 · Premier relevé: 2026-09-16 · Dernière observation: 2026-09-16Candidat à une revérification diagnostique
-
observé UNKNOWN exit 1 Lacune de preuve ×1 9.2.1 executionContext=node · moduleSystem=cjs · os=linux · runtime=node@22.23 sha256:c0573fd829b8…<url> · import confirm, { promptConfirm } from <str>; · ^^^^^^^ · SyntaxError: The requested module <str> does not provide an export named <str>node · unclassified-diagnostic · outer node · gap stage-unknownQualité de preuve: complete · Variantes d’environnement: 1 · Premier relevé: 2026-09-16 · Dernière observation: 2026-09-16Candidat à une revérification diagnostique
-
observé UNKNOWN exit 1 ERR_ASSERTION Lacune de preuve ×1 9.2.1 executionContext=node · moduleSystem=cjs · os=linux · runtime=node@22.23 @inquirer/core.AbortPromptError sha256:deb29d18a641…Test failed: AssertionError [ERR_ASSERTION]: Expected values to be strictly equal: · + actual - expected · + <str> · - <str>node · unclassified-diagnostic · outer node · gap stage-unknownQualité de preuve: complete · Variantes d’environnement: 1 · Premier relevé: 2026-09-16 · Dernière observation: 2026-09-16Candidat à une revérification diagnostique
-
observé UNKNOWN exit 1 ERR_ASSERTION Lacune de preuve ×1 9.2.1 executionContext=node · moduleSystem=esm · os=linux · runtime=node@22.23 sha256:eff444dbb236…Contract test failure: AssertionError [ERR_ASSERTION]: Plain object should not be identified as Separator · true !== false · at testSeparator (<url>) …node · unclassified-diagnostic · outer node · gap stage-unknownQualité de preuve: complete · Variantes d’environnement: 1 · Premier relevé: 2026-09-16 · Dernière observation: 2026-09-16Candidat à une revérification diagnostique