기록npm@inquirer/core9.2.1@inquirer/core.AbortPromptError
조건 변경
현재 조건
@inquirer/core.AbortPromptError @9.2.1debian glibc · x64 · node 22 · npm · node
1회 중 1회 통과
검증 — 이 네트워크가 이 좌표에서 컨트랙트를 직접 실행했습니다.
샘플 있음 — 이 좌표에서 우리가 실행했고 통과함 (1)
- 프로젝트 관측
- 2 / 2
- 컨트랙트 검증
- 1 / 1
- 독립 보고 peer
- 1
- 마지막 기록
- 2026-09-17
열어 볼 수 있는 증거
의존성 건강도
이 릴리스의 의존성 조합과 실패 관측 결과
관측된 문제 1건 ·
정상 13건
| 라이브러리 | 버전 | 건강도 | 그 좌표에서 측정된 것 | 프로젝트 |
|---|---|---|---|---|
| @inquirer/figures | 1.0.15 | PASS 모든 관측 정상 통과 | 컨트랙트 통과 | 프로젝트-일 21개 |
| @inquirer/type | 2.0.0 | PASS 모든 관측 정상 통과 | 컨트랙트 통과 | 프로젝트-일 21개 |
| @types/mute-stream | 0.0.4 | PASS 모든 관측 정상 통과 | 컨트랙트 통과 | 프로젝트-일 21개 |
| @types/node | 22.20.2 | PASS 모든 관측 정상 통과 | 컨트랙트 통과 | 프로젝트-일 11개 |
| @types/node | 22.20.3 | PASS 모든 관측 정상 통과 | 컨트랙트 통과 | 프로젝트-일 10개 |
| @types/wrap-ansi | 3.0.0 | PASS 모든 관측 정상 통과 | 컨트랙트 통과 | 프로젝트-일 21개 |
| ansi-escapes | 4.3.2 | PASS 모든 관측 정상 통과 | 컨트랙트 통과 | 프로젝트-일 21개 |
| cli-width | 4.1.0 | PASS 모든 관측 정상 통과 | 컨트랙트 통과 | 프로젝트-일 21개 |
| mute-stream | 1.0.0 | PASS 모든 관측 정상 통과 | 컨트랙트 통과 | 프로젝트-일 20개 |
| signal-exit | 4.1.0 | PASS 모든 관측 정상 통과 | 컨트랙트 통과 | 프로젝트-일 21개 |
| strip-ansi | 6.0.1 | PASS 모든 관측 정상 통과 | 컨트랙트 통과 | 프로젝트-일 21개 |
| wrap-ansi | 6.2.0 | PASS 모든 관측 정상 통과 | 컨트랙트 통과 | 프로젝트-일 20개 |
| yoctocolors-cjs | 2.1.3 | PASS 모든 관측 정상 통과 | 컨트랙트 통과 | 프로젝트-일 21개 |
측정 열은 각 의존성 자신의 릴리스에 대한 것이지 두 릴리스의 조합에 대한 것이 아닙니다. 리졸버가 둘을 나란히 놓았다는 사실은 함께 동작한다는 증거가 아닙니다.
최근 실패 클러스터
-
관측됨 UNKNOWN exit 13 증거 공백 ×1 9.2.1 executionContext=node · moduleSystem=esm · os=linux · runtime=node@22.23 sha256:4a939d00eec4…Warning: Detected unsettled top-level await at <url>]:<n> · const ans = await promptPromise; · ^ · fil<path>:<n>node · unclassified-diagnostic · outer node · gap stage-unknown증거 품질: complete · 환경 변형: 1 · 최초 관측: 2026-09-16 · 마지막 관측: 2026-09-16진단 재검증 후보
-
관측됨 UNKNOWN exit 1 ERR_ASSERTION 증거 공백 ×1 9.2.1 executionContext=node · moduleSystem=cjs · os=linux · runtime=node@22.23 @inquirer/core.AbortPromptError sha256:b12460008ca6…Test failed: AssertionError [ERR_ASSERTION]: Expected values to be strictly equal: · true !== false · at runTests (<url>) · at <url>node · unclassified-diagnostic · outer node · gap stage-unknown증거 품질: complete · 환경 변형: 1 · 최초 관측: 2026-09-16 · 마지막 관측: 2026-09-16진단 재검증 후보
-
관측됨 UNKNOWN exit 1 증거 공백 ×1 9.2.1 executionContext=node · moduleSystem=cjs · os=linux · runtime=node@22.23 sha256:c0573fd829b8…<url> · import confirm, { promptConfirm } from <str>; · ^^^^^^^ · SyntaxError: The requested module <str> does not provide an export named <str>node · unclassified-diagnostic · outer node · gap stage-unknown증거 품질: complete · 환경 변형: 1 · 최초 관측: 2026-09-16 · 마지막 관측: 2026-09-16진단 재검증 후보
-
관측됨 UNKNOWN exit 1 ERR_ASSERTION 증거 공백 ×1 9.2.1 executionContext=node · moduleSystem=cjs · os=linux · runtime=node@22.23 @inquirer/core.AbortPromptError sha256:deb29d18a641…Test failed: AssertionError [ERR_ASSERTION]: Expected values to be strictly equal: · + actual - expected · + <str> · - <str>node · unclassified-diagnostic · outer node · gap stage-unknown증거 품질: complete · 환경 변형: 1 · 최초 관측: 2026-09-16 · 마지막 관측: 2026-09-16진단 재검증 후보
-
관측됨 UNKNOWN exit 1 ERR_ASSERTION 증거 공백 ×1 9.2.1 executionContext=node · moduleSystem=esm · os=linux · runtime=node@22.23 sha256:eff444dbb236…Contract test failure: AssertionError [ERR_ASSERTION]: Plain object should not be identified as Separator · true !== false · at testSeparator (<url>) …node · unclassified-diagnostic · outer node · gap stage-unknown증거 품질: complete · 환경 변형: 1 · 최초 관측: 2026-09-16 · 마지막 관측: 2026-09-16진단 재검증 후보