Aufzeichnungennpm@inquirer/core9.2.1@inquirer/core.createPrompt
Bedingungen ändern
Aktuelle Bedingungen
@inquirer/core.createPrompt @9.2.1ubuntu glibc · x64 · node 22 · npm 10 · node
0 von 2 bestanden
Verifiziert — dieses Netzwerk hat an dieser Koordinate einen Contract ausgeführt.
hier gibt es ein Sample, und unser Lauf an dieser Koordinate ist fehlgeschlagen (1)
- Projektbeobachtungen
- 4 / 4
- Contract-Verifikationen
- 0 / 2
- Unabhängig meldende Peers
- 1
- Zuletzt erfasst
- 2026-09-16
Abhängigkeits-Zustand
Beobachtete Kombinationen und Fehlernachweise für dieses Release
Erster beobachteter Fehler
9.2.1
linux · node@22.23 · moduleSystem=esm · executionContext=node
1 FAIL
· stage: UNKNOWN
· fingerprint: sha256:4a939d00eec492b9a03b26b042fb8a8194c85e6b0782361ef967eb9b259f03ba
| Bibliothek | Version | Zustand | Dort gemessen | Projekte |
|---|---|---|---|---|
| @inquirer/figures | 1.0.15 | PASS Alle Beobachtungen bestanden | Contract bestanden | 21 Projekttage |
| @inquirer/type | 2.0.0 | PASS Alle Beobachtungen bestanden | Contract bestanden | 21 Projekttage |
| @types/mute-stream | 0.0.4 | PASS Alle Beobachtungen bestanden | Contract bestanden | 21 Projekttage |
| @types/node | 22.20.2 | PASS Alle Beobachtungen bestanden | Contract bestanden | 11 Projekttage |
| @types/node | 22.20.3 | PASS Alle Beobachtungen bestanden | Contract bestanden | 10 Projekttage |
| @types/wrap-ansi | 3.0.0 | PASS Alle Beobachtungen bestanden | Contract bestanden | 21 Projekttage |
| ansi-escapes | 4.3.2 | PASS Alle Beobachtungen bestanden | Contract bestanden | 21 Projekttage |
| cli-width | 4.1.0 | PASS Alle Beobachtungen bestanden | Contract bestanden | 21 Projekttage |
| mute-stream | 1.0.0 | PASS Alle Beobachtungen bestanden | Contract bestanden | 20 Projekttage |
| signal-exit | 4.1.0 | PASS Alle Beobachtungen bestanden | Contract bestanden | 21 Projekttage |
| strip-ansi | 6.0.1 | PASS Alle Beobachtungen bestanden | Contract bestanden | 21 Projekttage |
| wrap-ansi | 6.2.0 | PASS Alle Beobachtungen bestanden | Contract bestanden | 20 Projekttage |
| yoctocolors-cjs | 2.1.3 | PASS Alle Beobachtungen bestanden | Contract bestanden | 21 Projekttage |
Die Messspalte betrifft das Release der jeweiligen Abhängigkeit selbst, nicht das Paar. Dass ein Resolver zwei Releases nebeneinandergestellt hat, ist kein Beleg dafür, dass sie zusammen funktionieren.
Aktuelle Fehler-Cluster
-
beobachtet UNKNOWN exit 13 Beweislücke ×1 9.2.1 executionContext=node · moduleSystem=esm · os=linux · runtime=node@22.23 sha256:4a939d00eec4…Warning: Detected unsettled top-level await at <url>]:<n> · const ans = await promptPromise; · ^ · fil<path>:<n>node · unclassified-diagnostic · outer node · gap stage-unknownBeweisqualität: complete · Umgebungsvarianten: 1 · Zuerst erfasst: 2026-09-16 · Zuletzt gesehen: 2026-09-16Kandidat für diagnostische Neuprüfung
-
beobachtet UNKNOWN exit 1 ERR_ASSERTION Beweislücke ×1 9.2.1 executionContext=node · moduleSystem=cjs · os=linux · runtime=node@22.23 @inquirer/core.createPrompt sha256:b12460008ca6…Test failed: AssertionError [ERR_ASSERTION]: Expected values to be strictly equal: · true !== false · at runTests (<url>) · at <url>node · unclassified-diagnostic · outer node · gap stage-unknownBeweisqualität: complete · Umgebungsvarianten: 1 · Zuerst erfasst: 2026-09-16 · Zuletzt gesehen: 2026-09-16Kandidat für diagnostische Neuprüfung
-
beobachtet UNKNOWN exit 1 Beweislücke ×1 9.2.1 executionContext=node · moduleSystem=cjs · os=linux · runtime=node@22.23 sha256:c0573fd829b8…<url> · import confirm, { promptConfirm } from <str>; · ^^^^^^^ · SyntaxError: The requested module <str> does not provide an export named <str>node · unclassified-diagnostic · outer node · gap stage-unknownBeweisqualität: complete · Umgebungsvarianten: 1 · Zuerst erfasst: 2026-09-16 · Zuletzt gesehen: 2026-09-16Kandidat für diagnostische Neuprüfung
-
beobachtet UNKNOWN exit 1 ERR_ASSERTION Beweislücke ×1 9.2.1 executionContext=node · moduleSystem=cjs · os=linux · runtime=node@22.23 @inquirer/core.createPrompt sha256:deb29d18a641…Test failed: AssertionError [ERR_ASSERTION]: Expected values to be strictly equal: · + actual - expected · + <str> · - <str>node · unclassified-diagnostic · outer node · gap stage-unknownBeweisqualität: complete · Umgebungsvarianten: 1 · Zuerst erfasst: 2026-09-16 · Zuletzt gesehen: 2026-09-16Kandidat für diagnostische Neuprüfung
-
beobachtet UNKNOWN exit 1 ERR_ASSERTION Beweislücke ×1 9.2.1 executionContext=node · moduleSystem=esm · os=linux · runtime=node@22.23 sha256:eff444dbb236…Contract test failure: AssertionError [ERR_ASSERTION]: Plain object should not be identified as Separator · true !== false · at testSeparator (<url>) …node · unclassified-diagnostic · outer node · gap stage-unknownBeweisqualität: complete · Umgebungsvarianten: 1 · Zuerst erfasst: 2026-09-16 · Zuletzt gesehen: 2026-09-16Kandidat für diagnostische Neuprüfung