Записиnpm@inquirer/core9.2.1@inquirer/core.Separator
Изменить условия
Текущие условия
@inquirer/core.Separator @9.2.1ubuntu glibc · x64 · node 22 · npm 10 · node
0 из 2 прошли
Проверено — эта сеть выполнила контракт в этой координате.
образец есть — наш запуск в этой координате не прошёл (1)
- Наблюдения в проектах
- 2 / 2
- Проверки контрактом
- 0 / 2
- Независимые сообщившие пиры
- 1
- Последняя запись
- 2026-09-16
Свидетельства, которые можно открыть
Здоровье зависимостей
Наблюдаемые комбинации и свидетельства сбоев для этого выпуска
Замечено проблем: 1 ·
Стабильно: 13
Первый обнаруженный сбой
9.2.1
linux · node@22.23 · moduleSystem=esm · executionContext=node
1 FAIL
· stage: UNKNOWN
· fingerprint: sha256:4a939d00eec492b9a03b26b042fb8a8194c85e6b0782361ef967eb9b259f03ba
| Библиотека | Версия | Состояние | Измерено там | Проектов |
|---|---|---|---|---|
| @inquirer/figures | 1.0.15 | PASS Все наблюдения прошли успешно | контракт пройден | 21 проектный день |
| @inquirer/type | 2.0.0 | PASS Все наблюдения прошли успешно | контракт пройден | 21 проектный день |
| @types/mute-stream | 0.0.4 | PASS Все наблюдения прошли успешно | контракт пройден | 21 проектный день |
| @types/node | 22.20.2 | PASS Все наблюдения прошли успешно | контракт пройден | 11 проектных дней |
| @types/node | 22.20.3 | PASS Все наблюдения прошли успешно | контракт пройден | 10 проектных дней |
| @types/wrap-ansi | 3.0.0 | PASS Все наблюдения прошли успешно | контракт пройден | 21 проектный день |
| ansi-escapes | 4.3.2 | PASS Все наблюдения прошли успешно | контракт пройден | 21 проектный день |
| cli-width | 4.1.0 | PASS Все наблюдения прошли успешно | контракт пройден | 21 проектный день |
| mute-stream | 1.0.0 | PASS Все наблюдения прошли успешно | контракт пройден | 20 проектных дней |
| signal-exit | 4.1.0 | PASS Все наблюдения прошли успешно | контракт пройден | 21 проектный день |
| strip-ansi | 6.0.1 | PASS Все наблюдения прошли успешно | контракт пройден | 21 проектный день |
| wrap-ansi | 6.2.0 | PASS Все наблюдения прошли успешно | контракт пройден | 20 проектных дней |
| yoctocolors-cjs | 2.1.3 | PASS Все наблюдения прошли успешно | контракт пройден | 21 проектный день |
Столбец измерения относится к релизу самой зависимости, а не к паре. То, что резолвер поставил два релиза рядом, не доказывает, что они работают вместе.
Недавние кластеры сбоев
-
наблюдалось UNKNOWN exit 13 Пробел в данных ×1 9.2.1 executionContext=node · moduleSystem=esm · os=linux · runtime=node@22.23 sha256:4a939d00eec4…Warning: Detected unsettled top-level await at <url>]:<n> · const ans = await promptPromise; · ^ · fil<path>:<n>node · unclassified-diagnostic · outer node · gap stage-unknownКачество данных: complete · Варианты среды: 1 · Первая запись: 2026-09-16 · Последнее наблюдение: 2026-09-16Кандидат на диагностическую перепроверку
-
наблюдалось UNKNOWN exit 1 ERR_ASSERTION Пробел в данных ×1 9.2.1 executionContext=node · moduleSystem=cjs · os=linux · runtime=node@22.23 @inquirer/core.Separator sha256:b12460008ca6…Test failed: AssertionError [ERR_ASSERTION]: Expected values to be strictly equal: · true !== false · at runTests (<url>) · at <url>node · unclassified-diagnostic · outer node · gap stage-unknownКачество данных: complete · Варианты среды: 1 · Первая запись: 2026-09-16 · Последнее наблюдение: 2026-09-16Кандидат на диагностическую перепроверку
-
наблюдалось UNKNOWN exit 1 Пробел в данных ×1 9.2.1 executionContext=node · moduleSystem=cjs · os=linux · runtime=node@22.23 sha256:c0573fd829b8…<url> · import confirm, { promptConfirm } from <str>; · ^^^^^^^ · SyntaxError: The requested module <str> does not provide an export named <str>node · unclassified-diagnostic · outer node · gap stage-unknownКачество данных: complete · Варианты среды: 1 · Первая запись: 2026-09-16 · Последнее наблюдение: 2026-09-16Кандидат на диагностическую перепроверку
-
наблюдалось UNKNOWN exit 1 ERR_ASSERTION Пробел в данных ×1 9.2.1 executionContext=node · moduleSystem=cjs · os=linux · runtime=node@22.23 @inquirer/core.Separator sha256:deb29d18a641…Test failed: AssertionError [ERR_ASSERTION]: Expected values to be strictly equal: · + actual - expected · + <str> · - <str>node · unclassified-diagnostic · outer node · gap stage-unknownКачество данных: complete · Варианты среды: 1 · Первая запись: 2026-09-16 · Последнее наблюдение: 2026-09-16Кандидат на диагностическую перепроверку
-
наблюдалось UNKNOWN exit 1 ERR_ASSERTION Пробел в данных ×1 9.2.1 executionContext=node · moduleSystem=esm · os=linux · runtime=node@22.23 sha256:eff444dbb236…Contract test failure: AssertionError [ERR_ASSERTION]: Plain object should not be identified as Separator · true !== false · at testSeparator (<url>) …node · unclassified-diagnostic · outer node · gap stage-unknownКачество данных: complete · Варианты среды: 1 · Первая запись: 2026-09-16 · Последнее наблюдение: 2026-09-16Кандидат на диагностическую перепроверку