記録npm@inquirer/core9.2.1@inquirer/core.Separator
条件を変更
現在の条件
@inquirer/core.Separator @9.2.1ubuntu glibc · x64 · node 22 · npm 10 · node
2 回中 0 回が成功
検証 — このネットワークがこの座標でコントラクトを実行しました。
サンプルあり — この座標で実行し、失敗した (1)
- プロジェクト観測
- 2 / 2
- コントラクト検証
- 0 / 2
- 独立した報告ピア
- 1
- 最終記録
- 2026-09-16
開ける証拠
依存関係のヘルス
このリリースの依存関係の組み合わせと失敗観測
観測された問題 1件 ·
正常 13件
| ライブラリ | バージョン | ヘルス | その座標で測定されたこと | プロジェクト |
|---|---|---|---|---|
| @inquirer/figures | 1.0.15 | PASS すべての観測で成功 | コントラクト合格 | プロジェクト日 21 件 |
| @inquirer/type | 2.0.0 | PASS すべての観測で成功 | コントラクト合格 | プロジェクト日 21 件 |
| @types/mute-stream | 0.0.4 | PASS すべての観測で成功 | コントラクト合格 | プロジェクト日 21 件 |
| @types/node | 22.20.2 | PASS すべての観測で成功 | コントラクト合格 | プロジェクト日 11 件 |
| @types/node | 22.20.3 | PASS すべての観測で成功 | コントラクト合格 | プロジェクト日 10 件 |
| @types/wrap-ansi | 3.0.0 | PASS すべての観測で成功 | コントラクト合格 | プロジェクト日 21 件 |
| ansi-escapes | 4.3.2 | PASS すべての観測で成功 | コントラクト合格 | プロジェクト日 21 件 |
| cli-width | 4.1.0 | PASS すべての観測で成功 | コントラクト合格 | プロジェクト日 21 件 |
| mute-stream | 1.0.0 | PASS すべての観測で成功 | コントラクト合格 | プロジェクト日 20 件 |
| signal-exit | 4.1.0 | PASS すべての観測で成功 | コントラクト合格 | プロジェクト日 21 件 |
| strip-ansi | 6.0.1 | PASS すべての観測で成功 | コントラクト合格 | プロジェクト日 21 件 |
| wrap-ansi | 6.2.0 | PASS すべての観測で成功 | コントラクト合格 | プロジェクト日 20 件 |
| yoctocolors-cjs | 2.1.3 | PASS すべての観測で成功 | コントラクト合格 | プロジェクト日 21 件 |
測定列は各依存関係自身のリリースに関するもので、2つのリリースの組み合わせに関するものではありません。リゾルバが2つを並べたという事実は、両者が協調して動く証拠ではありません。
最近の失敗クラスター
-
観測済み UNKNOWN exit 13 証拠の欠落 ×1 9.2.1 executionContext=node · moduleSystem=esm · os=linux · runtime=node@22.23 sha256:4a939d00eec4…Warning: Detected unsettled top-level await at <url>]:<n> · const ans = await promptPromise; · ^ · fil<path>:<n>node · unclassified-diagnostic · outer node · gap stage-unknown証拠品質: complete · 環境バリアント: 1 · 初回記録: 2026-09-16 · 最終観測: 2026-09-16診断再検証候補
-
観測済み UNKNOWN exit 1 ERR_ASSERTION 証拠の欠落 ×1 9.2.1 executionContext=node · moduleSystem=cjs · os=linux · runtime=node@22.23 @inquirer/core.Separator sha256:b12460008ca6…Test failed: AssertionError [ERR_ASSERTION]: Expected values to be strictly equal: · true !== false · at runTests (<url>) · at <url>node · unclassified-diagnostic · outer node · gap stage-unknown証拠品質: complete · 環境バリアント: 1 · 初回記録: 2026-09-16 · 最終観測: 2026-09-16診断再検証候補
-
観測済み UNKNOWN exit 1 証拠の欠落 ×1 9.2.1 executionContext=node · moduleSystem=cjs · os=linux · runtime=node@22.23 sha256:c0573fd829b8…<url> · import confirm, { promptConfirm } from <str>; · ^^^^^^^ · SyntaxError: The requested module <str> does not provide an export named <str>node · unclassified-diagnostic · outer node · gap stage-unknown証拠品質: complete · 環境バリアント: 1 · 初回記録: 2026-09-16 · 最終観測: 2026-09-16診断再検証候補
-
観測済み UNKNOWN exit 1 ERR_ASSERTION 証拠の欠落 ×1 9.2.1 executionContext=node · moduleSystem=cjs · os=linux · runtime=node@22.23 @inquirer/core.Separator sha256:deb29d18a641…Test failed: AssertionError [ERR_ASSERTION]: Expected values to be strictly equal: · + actual - expected · + <str> · - <str>node · unclassified-diagnostic · outer node · gap stage-unknown証拠品質: complete · 環境バリアント: 1 · 初回記録: 2026-09-16 · 最終観測: 2026-09-16診断再検証候補
-
観測済み UNKNOWN exit 1 ERR_ASSERTION 証拠の欠落 ×1 9.2.1 executionContext=node · moduleSystem=esm · os=linux · runtime=node@22.23 sha256:eff444dbb236…Contract test failure: AssertionError [ERR_ASSERTION]: Plain object should not be identified as Separator · true !== false · at testSeparator (<url>) …node · unclassified-diagnostic · outer node · gap stage-unknown証拠品質: complete · 環境バリアント: 1 · 初回記録: 2026-09-16 · 最終観測: 2026-09-16診断再検証候補