Registrosnpm@inquirer/core9.2.1@inquirer/core.AbortPromptError
Cambiar las condiciones
Condiciones actuales
@inquirer/core.AbortPromptError @9.2.1ubuntu glibc · x64 · node 22 · npm 10 · node
0 de 2 pasaron
Verificado: esta red ejecutó un contrato en esta coordenada.
hay una muestra aquí y nuestra ejecución en esta coordenada falló (1)
- Observaciones de proyectos
- 2 / 2
- Verificaciones de contrato
- 0 / 2
- Peers independientes que reportaron
- 1
- Último registro
- 2026-09-16
Evidencia que puedes abrir
Salud de dependencias
Combinaciones observadas y evidencia de fallos para esta versión
Problemas observados: 1 ·
Estables: 13
Primer fallo observado
9.2.1
linux · node@22.23 · moduleSystem=esm · executionContext=node
1 FAIL
· stage: UNKNOWN
· fingerprint: sha256:4a939d00eec492b9a03b26b042fb8a8194c85e6b0782361ef967eb9b259f03ba
| Biblioteca | Versión | Estado | Medido allí | Proyectos |
|---|---|---|---|---|
| @inquirer/figures | 1.0.15 | PASS Todas las observaciones pasaron | contrato aprobado | 21 días-proyecto |
| @inquirer/type | 2.0.0 | PASS Todas las observaciones pasaron | contrato aprobado | 21 días-proyecto |
| @types/mute-stream | 0.0.4 | PASS Todas las observaciones pasaron | contrato aprobado | 21 días-proyecto |
| @types/node | 22.20.2 | PASS Todas las observaciones pasaron | contrato aprobado | 11 días-proyecto |
| @types/node | 22.20.3 | PASS Todas las observaciones pasaron | contrato aprobado | 10 días-proyecto |
| @types/wrap-ansi | 3.0.0 | PASS Todas las observaciones pasaron | contrato aprobado | 21 días-proyecto |
| ansi-escapes | 4.3.2 | PASS Todas las observaciones pasaron | contrato aprobado | 21 días-proyecto |
| cli-width | 4.1.0 | PASS Todas las observaciones pasaron | contrato aprobado | 21 días-proyecto |
| mute-stream | 1.0.0 | PASS Todas las observaciones pasaron | contrato aprobado | 20 días-proyecto |
| signal-exit | 4.1.0 | PASS Todas las observaciones pasaron | contrato aprobado | 21 días-proyecto |
| strip-ansi | 6.0.1 | PASS Todas las observaciones pasaron | contrato aprobado | 21 días-proyecto |
| wrap-ansi | 6.2.0 | PASS Todas las observaciones pasaron | contrato aprobado | 20 días-proyecto |
| yoctocolors-cjs | 2.1.3 | PASS Todas las observaciones pasaron | contrato aprobado | 21 días-proyecto |
La columna de medición se refiere a la versión de cada dependencia en sí, no al par. Que un resolutor haya colocado dos versiones juntas no prueba que funcionen juntas.
Clústeres de fallos recientes
-
observado UNKNOWN exit 13 Brecha de evidencia ×1 9.2.1 executionContext=node · moduleSystem=esm · os=linux · runtime=node@22.23 sha256:4a939d00eec4…Warning: Detected unsettled top-level await at <url>]:<n> · const ans = await promptPromise; · ^ · fil<path>:<n>node · unclassified-diagnostic · outer node · gap stage-unknownCalidad de evidencia: complete · Variantes de entorno: 1 · Primer registro: 2026-09-16 · Última observación: 2026-09-16Candidato a reverificación diagnóstica
-
observado UNKNOWN exit 1 ERR_ASSERTION Brecha de evidencia ×1 9.2.1 executionContext=node · moduleSystem=cjs · os=linux · runtime=node@22.23 @inquirer/core.AbortPromptError sha256:b12460008ca6…Test failed: AssertionError [ERR_ASSERTION]: Expected values to be strictly equal: · true !== false · at runTests (<url>) · at <url>node · unclassified-diagnostic · outer node · gap stage-unknownCalidad de evidencia: complete · Variantes de entorno: 1 · Primer registro: 2026-09-16 · Última observación: 2026-09-16Candidato a reverificación diagnóstica
-
observado UNKNOWN exit 1 Brecha de evidencia ×1 9.2.1 executionContext=node · moduleSystem=cjs · os=linux · runtime=node@22.23 sha256:c0573fd829b8…<url> · import confirm, { promptConfirm } from <str>; · ^^^^^^^ · SyntaxError: The requested module <str> does not provide an export named <str>node · unclassified-diagnostic · outer node · gap stage-unknownCalidad de evidencia: complete · Variantes de entorno: 1 · Primer registro: 2026-09-16 · Última observación: 2026-09-16Candidato a reverificación diagnóstica
-
observado UNKNOWN exit 1 ERR_ASSERTION Brecha de evidencia ×1 9.2.1 executionContext=node · moduleSystem=cjs · os=linux · runtime=node@22.23 @inquirer/core.AbortPromptError sha256:deb29d18a641…Test failed: AssertionError [ERR_ASSERTION]: Expected values to be strictly equal: · + actual - expected · + <str> · - <str>node · unclassified-diagnostic · outer node · gap stage-unknownCalidad de evidencia: complete · Variantes de entorno: 1 · Primer registro: 2026-09-16 · Última observación: 2026-09-16Candidato a reverificación diagnóstica
-
observado UNKNOWN exit 1 ERR_ASSERTION Brecha de evidencia ×1 9.2.1 executionContext=node · moduleSystem=esm · os=linux · runtime=node@22.23 sha256:eff444dbb236…Contract test failure: AssertionError [ERR_ASSERTION]: Plain object should not be identified as Separator · true !== false · at testSeparator (<url>) …node · unclassified-diagnostic · outer node · gap stage-unknownCalidad de evidencia: complete · Variantes de entorno: 1 · Primer registro: 2026-09-16 · Última observación: 2026-09-16Candidato a reverificación diagnóstica