Записиnpm@inquirer/core9.2.1@inquirer/core.isSpaceKey
Матрица совместимости
Наблюдения уровня проекта и проверки символов/контрактов считаются раздельно и никогда не суммируются.
Эти числа не различают, как именно был вызван символ: перегрузки, наборы аргументов и опции считаются вместе. Что делает конкретная форма вызова, доказывает контракт образца, а не эти цифры.
| Окружение | Достоверность | Наблюдения | Проверено | Доля успешных | Пиры | Последнее наблюдение |
|---|---|---|---|---|---|---|
| node 22.23 · JS · npm · linux glibc
Наблюдения: PROJECT_PROCESS 1✓ — Проверено: UNKNOWN 0✓ 2✕
|
LOW | 1 | 2 | 33 % | 1 | 2026-09-16 |
| node 22.23 · JS · npm · linux glibc
Наблюдения: PROJECT_PROCESS 1✓
|
LOW | 1 | 0 | 100 % | 1 | 2026-09-16 |
snapshot · 2026-09-16
Кластеры сбоев
-
наблюдалось UNKNOWN exit 13 Пробел в данных ×1 9.2.1 executionContext=node · moduleSystem=esm · os=linux · runtime=node@22.23 sha256:4a939d00eec4…Warning: Detected unsettled top-level await at <url>]:<n> · const ans = await promptPromise; · ^ · fil<path>:<n>node · unclassified-diagnostic · outer node · gap stage-unknownКачество данных: complete · Варианты среды: 1 · Первая запись: 2026-09-16 · Последнее наблюдение: 2026-09-16Кандидат на диагностическую перепроверку
-
наблюдалось UNKNOWN exit 1 ERR_ASSERTION Пробел в данных ×1 9.2.1 executionContext=node · moduleSystem=cjs · os=linux · runtime=node@22.23 @inquirer/core.isSpaceKey sha256:b12460008ca6…Test failed: AssertionError [ERR_ASSERTION]: Expected values to be strictly equal: · true !== false · at runTests (<url>) · at <url>node · unclassified-diagnostic · outer node · gap stage-unknownКачество данных: complete · Варианты среды: 1 · Первая запись: 2026-09-16 · Последнее наблюдение: 2026-09-16Кандидат на диагностическую перепроверку
-
наблюдалось UNKNOWN exit 1 Пробел в данных ×1 9.2.1 executionContext=node · moduleSystem=cjs · os=linux · runtime=node@22.23 sha256:c0573fd829b8…<url> · import confirm, { promptConfirm } from <str>; · ^^^^^^^ · SyntaxError: The requested module <str> does not provide an export named <str>node · unclassified-diagnostic · outer node · gap stage-unknownКачество данных: complete · Варианты среды: 1 · Первая запись: 2026-09-16 · Последнее наблюдение: 2026-09-16Кандидат на диагностическую перепроверку
-
наблюдалось UNKNOWN exit 1 ERR_ASSERTION Пробел в данных ×1 9.2.1 executionContext=node · moduleSystem=cjs · os=linux · runtime=node@22.23 @inquirer/core.isSpaceKey sha256:deb29d18a641…Test failed: AssertionError [ERR_ASSERTION]: Expected values to be strictly equal: · + actual - expected · + <str> · - <str>node · unclassified-diagnostic · outer node · gap stage-unknownКачество данных: complete · Варианты среды: 1 · Первая запись: 2026-09-16 · Последнее наблюдение: 2026-09-16Кандидат на диагностическую перепроверку
-
наблюдалось UNKNOWN exit 1 ERR_ASSERTION Пробел в данных ×1 9.2.1 executionContext=node · moduleSystem=esm · os=linux · runtime=node@22.23 sha256:eff444dbb236…Contract test failure: AssertionError [ERR_ASSERTION]: Plain object should not be identified as Separator · true !== false · at testSeparator (<url>) …node · unclassified-diagnostic · outer node · gap stage-unknownКачество данных: complete · Варианты среды: 1 · Первая запись: 2026-09-16 · Последнее наблюдение: 2026-09-16Кандидат на диагностическую перепроверку