Recordsnpm@inquirer/core9.2.1@inquirer/core.isDownKey
OS × runtime at a glance
Reading a cell: The number is how many recorded observations the rate divides — one build files an observation per stage it reached, so it counts neither builds nor machines nor people. The document beside it is a different fact from a different source: whether a sample exists at that coordinate, and how our own run of it went there.
- no sample at this coordinate yet
- there is a sample here, and nothing of ours has run it at this coordinate yet
- there is a sample here, and our run of it at this coordinate came back clean
- there is a sample here, and our run of it at this coordinate failed
- there is a sample here, and this coordinate records both a passing and a failing run of it
- nothing recorded — unknown, never "works" and never "broken"
- there is a level below this cell — click to open it
A document means there is a sample at that coordinate. Whether one EXISTS is a fact about this release and this API and does not change with OS, runtime or package manager; its COLOUR is how that sample ran in the environment you are looking at.
Published samples
- @inquirer/core 9.2.1: Separator, makeTheme, isUpKey This network offers one thing: a sample that builds. It ran the sample in a sandbox and kept the signed receipt. It grades nothing and warrants nothing — whether the same code builds where you are is not something it measured. HOW@inquirer/core.Separator@inquirer/core.makeTheme@inquirer/core.isUpKey@inquirer/core.isDownKey@inquirer/core.AbortPromptError@inquirer/core.createPromptnode 22.23.2 MIT-0 · 2026-09-16
Compatibility matrix
Project-level observations and symbol/contract verifications are counted separately and never combined.
These counts do not distinguish how the symbol was called: overloads, argument shapes and options are pooled together. What a particular call shape does is proven by a sample's contract, not by these numbers.
| Environment | Confidence | Observations | Verified | Pass rate | Peers | Last seen |
|---|---|---|---|---|---|---|
| node 22 · JS · npm · linux glibc · docker
Observations: PROJECT_TEST 2✓ — Verified: CONTRACT 1✓
|
LOW | 2 | 1 | 100% | 1 · 1✓ | 2026-09-17 |
| node 22.23 · JS · npm · linux glibc
Observations: PROJECT_PROCESS 1✓ — Verified: UNKNOWN 0✓ 2✕
|
LOW | 1 | 2 | 33% | 1 | 2026-09-16 |
| node 22.23 · JS · npm · linux glibc
Observations: PROJECT_PROCESS 1✓
|
LOW | 1 | 0 | 100% | 1 | 2026-09-16 |
snapshot · 2026-09-17
Failure clusters
-
observed UNKNOWN exit 13 Evidence gap ×1 9.2.1 executionContext=node · moduleSystem=esm · os=linux · runtime=node@22.23 sha256:4a939d00eec4…Warning: Detected unsettled top-level await at <url>]:<n> · const ans = await promptPromise; · ^ · fil<path>:<n>node · unclassified-diagnostic · outer node · gap stage-unknownEvidence quality: complete · Environment variants: 1 · First recorded: 2026-09-16 · Last seen: 2026-09-16Diagnostic re-verification candidate
-
observed UNKNOWN exit 1 ERR_ASSERTION Evidence gap ×1 9.2.1 executionContext=node · moduleSystem=cjs · os=linux · runtime=node@22.23 @inquirer/core.isDownKey sha256:b12460008ca6…Test failed: AssertionError [ERR_ASSERTION]: Expected values to be strictly equal: · true !== false · at runTests (<url>) · at <url>node · unclassified-diagnostic · outer node · gap stage-unknownEvidence quality: complete · Environment variants: 1 · First recorded: 2026-09-16 · Last seen: 2026-09-16Diagnostic re-verification candidate
-
observed UNKNOWN exit 1 Evidence gap ×1 9.2.1 executionContext=node · moduleSystem=cjs · os=linux · runtime=node@22.23 sha256:c0573fd829b8…<url> · import confirm, { promptConfirm } from <str>; · ^^^^^^^ · SyntaxError: The requested module <str> does not provide an export named <str>node · unclassified-diagnostic · outer node · gap stage-unknownEvidence quality: complete · Environment variants: 1 · First recorded: 2026-09-16 · Last seen: 2026-09-16Diagnostic re-verification candidate
-
observed UNKNOWN exit 1 ERR_ASSERTION Evidence gap ×1 9.2.1 executionContext=node · moduleSystem=cjs · os=linux · runtime=node@22.23 @inquirer/core.isDownKey sha256:deb29d18a641…Test failed: AssertionError [ERR_ASSERTION]: Expected values to be strictly equal: · + actual - expected · + <str> · - <str>node · unclassified-diagnostic · outer node · gap stage-unknownEvidence quality: complete · Environment variants: 1 · First recorded: 2026-09-16 · Last seen: 2026-09-16Diagnostic re-verification candidate
-
observed UNKNOWN exit 1 ERR_ASSERTION Evidence gap ×1 9.2.1 executionContext=node · moduleSystem=esm · os=linux · runtime=node@22.23 sha256:eff444dbb236…Contract test failure: AssertionError [ERR_ASSERTION]: Plain object should not be identified as Separator · true !== false · at testSeparator (<url>) …node · unclassified-diagnostic · outer node · gap stage-unknownEvidence quality: complete · Environment variants: 1 · First recorded: 2026-09-16 · Last seen: 2026-09-16Diagnostic re-verification candidate