Aufzeichnungennpm@humanwhocodes/module-importer1.0.1
Bedingungen ändern
Aktuelle Bedingungen
@humanwhocodes/module-importer @1.0.1ubuntu glibc · x64 · node 22 · npm 10 · node
Paketsumme, keine API
0 von 16 bestanden
Verifiziert — dieses Netzwerk hat an dieser Koordinate einen Contract ausgeführt.
hier gibt es ein Sample, und unser Lauf an dieser Koordinate ist fehlgeschlagen (3)
- Projektbeobachtungen
- 103 / 106
- Contract-Verifikationen
- 0 / 16
- Nutzungsdatensätze
- 5
- Unabhängig meldende Peers
- 3
- Fehlschläge mit erfasstem Fingerabdruck
- 1 / 3
- Zuletzt erfasst
- 2026-09-17
Nachweise zum Öffnen
Abhängigkeits-Zustand
Eine Auflösung hat den Baum dieses Releases gelesen und keine Abhängigkeiten gefunden. Das ist eine Messung, keine fehlende.
Aktuelle Fehler-Cluster
-
beobachtet UNKNOWN exit 1 Beweislücke ×3 1.0.1 executionContext=node · moduleSystem=cjs · os=linux · runtime=node@22.23 sha256:91ad26545eb1…node:internal/modules/cjs/loader:<n> · throw err; · ^ · Error: Cannot find module <str>node · unclassified-diagnostic · outer node · gap stage-unknownBeweisqualität: complete · Umgebungsvarianten: 1 · Zuerst erfasst: 2026-08-31 · Zuletzt gesehen: 2026-09-06Kandidat für diagnostische Neuprüfung
-
beobachtet PROJECT_PROCESS ERR_ASSERTION Beweislücke ×2 1.0.1 executionContext=node · moduleSystem=cjs · os=linux · runtime=node@22.23Beweisqualität: legacy-evidence-incomplete · Umgebungsvarianten: 1 · Zuerst erfasst: 2026-08-20 · Zuletzt gesehen: 2026-08-29Kandidat für diagnostische Neuprüfung
-
beobachtet UNKNOWN exit 1 ERR_ASSERTION Beweislücke ×2 1.0.1 executionContext=node · moduleSystem=esm · os=linux · runtime=node@22.23 sha256:986d98189e70…node:internal/modules/run_main:<n> · triggerUncaughtException( · ^ · AssertionError [ERR_ASSERTION]: Expected values to be strictly equal:node · unclassified-diagnostic · outer node · gap stage-unknownBeweisqualität: complete · Umgebungsvarianten: 1 · Zuerst erfasst: 2026-08-29 · Zuletzt gesehen: 2026-09-05Kandidat für diagnostische Neuprüfung
-
beobachtet UNKNOWN exit 1 Beweislücke ×2 1.0.1 executionContext=node · os=linux · runtime=node@22.23 sha256:0bd98c410653…<path>:<n> · param.decorators.forEach(d => this.visit(d)); · ^ · TypeError: Cannot read properties of undefined (reading <str>)node · unclassified-diagnostic · outer node · gap stage-unknownBeweisqualität: complete · Umgebungsvarianten: 2 · Zuerst erfasst: 2026-09-05 · Zuletzt gesehen: 2026-09-05Kandidat für diagnostische Neuprüfung
-
beobachtet UNKNOWN exit 1 ERR_ASSERTION Beweislücke ×1 1.0.1 executionContext=node · moduleSystem=cjs · os=linux · runtime=node@22.23 sha256:2baa184da336…node:internal/assert/utils:<n> · throw err; · ^ · AssertionError [ERR_ASSERTION]: Global scope should record variable alphanode · unclassified-diagnostic · outer node · gap stage-unknownBeweisqualität: complete · Umgebungsvarianten: 1 · Zuerst erfasst: 2026-08-31 · Zuletzt gesehen: 2026-08-31Kandidat für diagnostische Neuprüfung
-
beobachtet UNKNOWN exit 1 Beweislücke ×1 1.0.1 executionContext=node · moduleSystem=cjs · os=linux · runtime=node@22.23 sha256:863c3ce8513d…Contract test failed: Error: Cannot find module <str> · Require stack: · - <path> · at Function._resolveFilename (node:internal/modules/cjs/loader:<n>:<n>)node · unclassified-diagnostic · outer node · gap stage-unknownBeweisqualität: complete · Umgebungsvarianten: 1 · Zuerst erfasst: 2026-08-31 · Zuletzt gesehen: 2026-08-31Kandidat für diagnostische Neuprüfung
-
beobachtet UNKNOWN exit 1 ERR_ASSERTION Beweislücke ×1 1.0.1 executionContext=node · moduleSystem=cjs · os=linux · runtime=node@22.23 sha256:0ab3a7004d66…node:assert:<n> · throw new AssertionError(obj); · ^ · AssertionError [ERR_ASSERTION]: Expected values to be strictly equal:node · unclassified-diagnostic · outer node · gap stage-unknownBeweisqualität: complete · Umgebungsvarianten: 1 · Zuerst erfasst: 2026-09-05 · Zuletzt gesehen: 2026-09-05Kandidat für diagnostische Neuprüfung
-
beobachtet UNKNOWN exit 1 Beweislücke ×1 1.0.1 executionContext=node · moduleSystem=cjs · os=linux · runtime=node@22.23 sha256:4bca8c3d12c4…<path>:<n> · throw new Error( · ^ · Error: To use `only`, use RuleTester with a test framework that provides `it.only()` like Mocha.node · unclassified-diagnostic · outer node · gap stage-unknownBeweisqualität: complete · Umgebungsvarianten: 1 · Zuerst erfasst: 2026-09-05 · Zuletzt gesehen: 2026-09-05Kandidat für diagnostische Neuprüfung
-
beobachtet UNKNOWN exit 1 Beweislücke ×1 1.0.1 executionContext=node · moduleSystem=cjs · os=linux · runtime=node@22.23 sha256:949b14711b05…[eval]:<n> · ast: new TSESLint.Linter().parse(<str>) · ^ · TypeError: (intermediate value).parse is not a functionnode · unclassified-diagnostic · outer node · gap stage-unknownBeweisqualität: complete · Umgebungsvarianten: 1 · Zuerst erfasst: 2026-09-05 · Zuletzt gesehen: 2026-09-05Kandidat für diagnostische Neuprüfung
-
beobachtet UNKNOWN exit 1 Beweislücke ×1 1.0.1 executionContext=node · moduleSystem=cjs · os=linux · runtime=node@22.23 sha256:e8e158b8a93f…<path>:<n> · node.implements.forEach(imp => this.visitType(imp)); · ^ · TypeError: Cannot read properties of undefined (reading <str>)node · unclassified-diagnostic · outer node · gap stage-unknownBeweisqualität: complete · Umgebungsvarianten: 1 · Zuerst erfasst: 2026-09-05 · Zuletzt gesehen: 2026-09-05Kandidat für diagnostische Neuprüfung
-
beobachtet PROJECT_TEST exit 1 ERR_ASSERTION ×1 1.0.1 executionContext=node · moduleSystem=esm · os=linux · runtime=node@22.23 sha256:84000a983e97…AssertionError [ERR_ASSERTION]: Nested unions should resolve and bitwise OR all constituent flags · 134217984 !== 352 · at <url> …javascript/test-runner · test-runner-diagnostic · outer npm testBeweisqualität: complete · Umgebungsvarianten: 1 · Zuerst erfasst: 2026-09-05 · Zuletzt gesehen: 2026-09-05
-
beobachtet UNKNOWN exit 1 Beweislücke ×1 1.0.1 executionContext=node · moduleSystem=esm · os=linux · runtime=node@22.23 sha256:8310a83be884…node:internal/modules/cjs/loader:<n> · const err = new Error(message); · ^ · Error: Cannot find module <str>node · unclassified-diagnostic · outer node · gap stage-unknownBeweisqualität: complete · Umgebungsvarianten: 1 · Zuerst erfasst: 2026-09-05 · Zuletzt gesehen: 2026-09-05Kandidat für diagnostische Neuprüfung
Es werden die 12 meistgemeldeten von 14 aufgezeichneten Fehlerclustern gezeigt. Der Rest sind Einzelmeldungen.