Registrosnpm@esbuild/netbsd-x640.21.5
Cambiar las condiciones
Condiciones actuales
@esbuild/netbsd-x64 @0.21.5alpine musl · x64 · node 22 · npm · node
total del paquete, no una API
1 de 1 pasaron
Verificado: esta red ejecutó un contrato en esta coordenada.
hay una muestra aquí y nuestra ejecución en esta coordenada terminó limpia (1)
- Observaciones de proyectos
- 2 / 2
- Verificaciones de contrato
- 1 / 1
- Registros de uso
- 1
- Peers independientes que reportaron
- 1
- Último registro
- 2026-08-30
Evidencia que puedes abrir
Salud de dependencias
Una resolución leyó el árbol de esta versión y no encontró dependencias. Es una medición, no una que falte.
Clústeres de fallos recientes
-
observado PROCESS_START process start failed Brecha de evidencia ×36 0.21.5 → 0.25.12 → 0.28.2 executionContext=node sha256:c12549970456…· structured-termination · gap diagnostic-missingCalidad de evidencia: partial · Variantes de entorno: 3 · Primer registro: 2026-08-31 · Última observación: 2026-09-16Candidato a reverificación diagnóstica
-
observado UNKNOWN exit 1 Brecha de evidencia ×3 0.21.5 → 0.25.12 executionContext=node · moduleSystem=esm · os=linux · runtime=node@22.23 sha256:8fd30f2a6304…fil<path>:<n> · throw new Error(errorMsg); · ^ · Error: Vitest failed to access its internal state.node · unclassified-diagnostic · outer node · gap stage-unknownCalidad de evidencia: complete · Variantes de entorno: 1 · Primer registro: 2026-08-31 · Última observación: 2026-09-08Candidato a reverificación diagnóstica
-
observado UNKNOWN exit 1 ERR_MODULE_NOT_FOUND Brecha de evidencia ×3 0.21.5 → 0.28.2 executionContext=node · moduleSystem=cjs · os=linux · runtime=node@22.23 sha256:88af852f99a8…node:internal/modules/package_json_reader:<n> · throw new ERR_MODULE_NOT_FOUND(packageName, fileURLToPath(base), null); · ^ …node · unclassified-diagnostic · outer node · gap stage-unknownCalidad de evidencia: complete · Variantes de entorno: 1 · Primer registro: 2026-09-07 · Última observación: 2026-09-14Candidato a reverificación diagnóstica
-
observado UNKNOWN exit 1 Brecha de evidencia ×2 0.21.5 executionContext=node · moduleSystem=cjs · os=linux · runtime=node@22.23 sha256:91ad26545eb1…node:internal/modules/cjs/loader:<n> · throw err; · ^ · Error: Cannot find module <str>node · unclassified-diagnostic · outer node · gap stage-unknownCalidad de evidencia: complete · Variantes de entorno: 1 · Primer registro: 2026-08-31 · Última observación: 2026-09-07Candidato a reverificación diagnóstica
-
observado UNKNOWN exit 1 Brecha de evidencia ×1 0.21.5 executionContext=node · moduleSystem=cjs · os=linux · runtime=node@22.23 sha256:72ba2d1e946f…<path>: No module named pippython3 · unclassified-diagnostic · outer python3 · gap stage-unknownCalidad de evidencia: complete · Variantes de entorno: 1 · Primer registro: 2026-08-31 · Última observación: 2026-08-31Candidato a reverificación diagnóstica
-
observado UNKNOWN exit 1 Brecha de evidencia ×1 0.21.5 executionContext=node · moduleSystem=cjs · os=linux · runtime=node@22.23 sha256:d7f5d491441c…Traceback (most recent call last): · File <str>, line 71, in <module> · AssertionError: is_annotated must return True for Annotated· unclassified-diagnostic · gap stage-unknownCalidad de evidencia: complete · Variantes de entorno: 1 · Primer registro: 2026-08-31 · Última observación: 2026-08-31Candidato a reverificación diagnóstica
-
observado UNKNOWN exit 1 Brecha de evidencia ×1 0.21.5 executionContext=node · moduleSystem=esm · os=linux · runtime=node@22.23 sha256:42623a56826f…fil<path>:<n> · Object.defineProperty(expect.not, expectAssertionName, { · ^ · TypeError: Object.defineProperty called on non-objectnode · unclassified-diagnostic · outer node · gap stage-unknownCalidad de evidencia: complete · Variantes de entorno: 1 · Primer registro: 2026-09-04 · Última observación: 2026-09-04Candidato a reverificación diagnóstica
-
observado UNKNOWN exit 1 Brecha de evidencia ×1 0.21.5 executionContext=node · moduleSystem=cjs · os=linux · runtime=node@22.23 sha256:148f04041544…atomic: true, · followSymlinks: true, · awaitWriteFinish: false · },node · unclassified-diagnostic · outer node · gap stage-unknownCalidad de evidencia: complete · Variantes de entorno: 1 · Primer registro: 2026-09-07 · Última observación: 2026-09-07Candidato a reverificación diagnóstica
-
observado UNKNOWN exit 1 ERR_ASSERTION Brecha de evidencia ×1 0.21.5 executionContext=node · moduleSystem=esm · os=linux · runtime=node@22.23 sha256:43caf7a060e7…node:internal/modules/run_main:<n> · triggerUncaughtException( · ^ · AssertionError [ERR_ASSERTION]: Expected values to be strictly deep-equal:node · unclassified-diagnostic · outer node · gap stage-unknownCalidad de evidencia: complete · Variantes de entorno: 1 · Primer registro: 2026-09-07 · Última observación: 2026-09-07Candidato a reverificación diagnóstica
-
observado UNKNOWN exit 1 Brecha de evidencia ×1 0.21.5 executionContext=node · moduleSystem=cjs · os=linux · runtime=node@22.23 sha256:43ce3cf35eeb…(!) Could not auto-determine entry point from rollupOptions or html files and there are no explicit optimizeDeps.include patterns. Skipping dependency …node · unclassified-diagnostic · outer node · gap stage-unknownCalidad de evidencia: complete · Variantes de entorno: 1 · Primer registro: 2026-09-07 · Última observación: 2026-09-07Candidato a reverificación diagnóstica
-
observado UNKNOWN exit 1 ERR_ASSERTION Brecha de evidencia ×1 0.21.5 executionContext=node · moduleSystem=esm · os=linux · runtime=node@22.23 sha256:a135683647c7…Test failed: AssertionError [ERR_ASSERTION]: Chunk should contain replaced define constant · at runTest (<url>) …node · unclassified-diagnostic · outer node · gap stage-unknownCalidad de evidencia: complete · Variantes de entorno: 1 · Primer registro: 2026-09-07 · Última observación: 2026-09-07Candidato a reverificación diagnóstica
-
observado UNKNOWN exit 1 ERR_OUTDATED_OPTIMIZED_DEP Brecha de evidencia ×1 0.21.5 executionContext=node · moduleSystem=cjs · os=linux · runtime=node@22.23 sha256:f55a6b191c8a…fil<path>:<n> · const err = new Error( · ^ · Error: There is a new version of the pre-bundle for <str>, a page reload is going to ask for it.node · unclassified-diagnostic · outer node · gap stage-unknownCalidad de evidencia: complete · Variantes de entorno: 1 · Primer registro: 2026-09-07 · Última observación: 2026-09-07Candidato a reverificación diagnóstica