기록npm@babel/template8.0.0
조건 변경
현재 조건
@babel/template @8.0.0debian glibc · x64 · node 22 · npm · node
API가 아니라 패키지 전체 집계
프로젝트에 존재한 기록만 있습니다. 이 좌표에서 실행된 것은 없습니다.
관측 — 실제 프로젝트 빌드가 이 좌표에서 보고되었습니다.
샘플 있음 — 이 좌표에서는 아직 우리가 실행하지 않음 (1)
- 프로젝트 관측
- 이 좌표에는 없음
- 컨트랙트 검증
- 이 좌표에는 없음
- 사용 기록
- 9
- 독립 보고 peer
- 1
- 마지막 기록
- 2026-09-07
열어 볼 수 있는 증거
의존성 건강도
이 릴리스의 의존성 조합과 실패 관측 결과
관측된 문제 1건 ·
변경 4건 ·
정상 0건
| 라이브러리 | 버전 | 건강도 | 그 좌표에서 측정된 것 | 프로젝트 |
|---|---|---|---|---|
| @babel/code-frame | 8.0.0 | CANDIDATE 상관 변경; 조합 결과 미증명 | 컨트랙트 통과 | 프로젝트-일 42개 |
| @babel/parser | 8.0.4 | CANDIDATE 상관 변경; 조합 결과 미증명 | 컨트랙트 통과 | 프로젝트-일 44개 |
| @babel/types | 8.0.0 | CANDIDATE 상관 변경; 조합 결과 미증명 | 컨트랙트 통과 | 프로젝트-일 2개 |
| @babel/types | 8.0.4 | CANDIDATE 상관 변경; 조합 결과 미증명 | 컨트랙트 통과 | 프로젝트-일 42개 |
측정 열은 각 의존성 자신의 릴리스에 대한 것이지 두 릴리스의 조합에 대한 것이 아닙니다. 리졸버가 둘을 나란히 놓았다는 사실은 함께 동작한다는 증거가 아닙니다.
릴리스별 의존성 버전
이 패키지의 릴리스마다 자식이 어떤 버전으로 해석됐는지입니다. 버전이 움직인 자식이 먼저 나옵니다 — 업그레이드가 발밑에서 무언가를 바꾼 지점입니다.
| 라이브러리 | 8.0.0 | 7.29.7 | 7.27.2 |
|---|---|---|---|
| @babel/code-frame | 8.0.0 | 7.29.7 | 7.27.1 |
| @babel/parser | 8.0.4 | 7.29.7 | 7.28.5 |
| @babel/types | 8.0.0 | 7.29.7 | 7.28.5 |
움직임: 3 · 모든 릴리스에서 동일: 0
엣지는 실제 기계에서 리졸버가 한 릴리스를 다른 릴리스 옆에 놓았다는 기록입니다. 둘이 함께 동작한다는 주장이 아닙니다. 그 질문은 여기 행이 있다는 사실이 아니라 샘플과 컨트랙트가 답합니다.
최근 실패 클러스터
-
관측됨 UNKNOWN exit 1 ERR_MODULE_NOT_FOUND 증거 공백 ×7 7.29.7 → 8.0.0 executionContext=node · os=linux · runtime=node@22.23 sha256:88af852f99a8…node:internal/modules/package_json_reader:<n> · throw new ERR_MODULE_NOT_FOUND(packageName, fileURLToPath(base), null); · ^ …node · unclassified-diagnostic · outer node · gap stage-unknown증거 품질: complete · 환경 변형: 2 · 최초 관측: 2026-08-30 · 마지막 관측: 2026-09-05진단 재검증 후보
-
관측됨 UNKNOWN exit 1 ERR_ASSERTION 증거 공백 ×5 7.29.7 → 8.0.0 executionContext=node · os=linux · runtime=node@22.23 sha256:986d98189e70…node:internal/modules/run_main:<n> · triggerUncaughtException( · ^ · AssertionError [ERR_ASSERTION]: Expected values to be strictly equal:node · unclassified-diagnostic · outer node · gap stage-unknown증거 품질: complete · 환경 변형: 2 · 최초 관측: 2026-08-30 · 마지막 관측: 2026-09-04진단 재검증 후보
-
관측됨 PROCESS_START process start failed 증거 공백 ×3 7.29.7 → 8.0.0 executionContext=node sha256:c12549970456…· structured-termination · gap diagnostic-missing증거 품질: partial · 환경 변형: 2 · 최초 관측: 2026-09-05 · 마지막 관측: 2026-09-15진단 재검증 후보
-
관측됨 UNKNOWN exit 1 증거 공백 ×2 8.0.0 executionContext=node · moduleSystem=esm · os=linux · runtime=node@22.23 sha256:455451e1a14e…<url>]:<n> · import babel from <str>; · ^^^^^ · SyntaxError: The requested module <str> does not provide an export named <str>node · unclassified-diagnostic · outer node · gap stage-unknown증거 품질: complete · 환경 변형: 1 · 최초 관측: 2026-09-02 · 마지막 관측: 2026-09-05진단 재검증 후보
-
관측됨 UNKNOWN exit 1 ERR_ASSERTION 증거 공백 ×1 8.0.0 executionContext=node · moduleSystem=esm · os=linux · runtime=node@22.23 sha256:c713e7987e7b…node:internal/modules/run_main:<n> · triggerUncaughtException( · ^ · AssertionError [ERR_ASSERTION]: Inner visitor must handle ForOfStatementnode · unclassified-diagnostic · outer node · gap stage-unknown증거 품질: complete · 환경 변형: 1 · 최초 관측: 2026-08-31 · 마지막 관측: 2026-08-31진단 재검증 후보
-
관측됨 UNKNOWN exit 1 증거 공백 ×1 8.0.0 executionContext=node · moduleSystem=esm · os=linux · runtime=node@22.23 sha256:fb30df1477f2…<url> · assert.strictEqual(output.includes(<str>2.0.0<str>), true); · ^^^^^^^^^^^^^^^^^^^^^^^^^^^^^^^^^^^^^^^^ · SyntaxError: missing ) after argument listnode · unclassified-diagnostic · outer node · gap stage-unknown증거 품질: complete · 환경 변형: 1 · 최초 관측: 2026-09-02 · 마지막 관측: 2026-09-02진단 재검증 후보
-
관측됨 UNKNOWN exit 1 증거 공백 ×1 8.0.0 executionContext=node · moduleSystem=esm · os=linux · runtime=node@22.23 sha256:ff4ca6a168fb…fil<path>:<n> · const error = new SyntaxError(); · ^ · SyntaxError: unknown: <str> outside of function. (10:<n>)node · unclassified-diagnostic · outer node · gap stage-unknown증거 품질: complete · 환경 변형: 1 · 최초 관측: 2026-09-02 · 마지막 관측: 2026-09-02진단 재검증 후보
-
관측됨 UNKNOWN exit 1 ERR_ASSERTION 증거 공백 ×1 8.0.0 executionContext=node · moduleSystem=esm · os=linux · runtime=node@22.23 sha256:963dc79aa288…node:internal/modules/run_main:<n> · triggerUncaughtException( · ^ · AssertionError [ERR_ASSERTION]: Arrow function must be converted to function expressionnode · unclassified-diagnostic · outer node · gap stage-unknown증거 품질: complete · 환경 변형: 1 · 최초 관측: 2026-09-03 · 마지막 관측: 2026-09-03진단 재검증 후보
-
관측됨 PROJECT_RESOLVE exit 1 ×1 8.0.0 executionContext=node · moduleSystem=cjs · os=linux · runtime=node@22.23 sha256:15e1b71df43a…test_contract.go:<n>:<n>: no required module provides package golang.org/x/text/unicode/norm: go.mod file not found in current directory or any parent …go/module · resolve-diagnostic · outer go run증거 품질: complete · 환경 변형: 1 · 최초 관측: 2026-09-05 · 마지막 관측: 2026-09-05
-
관측됨 UNKNOWN exit 1 증거 공백 ×1 8.0.0 executionContext=node · moduleSystem=esm · os=linux · runtime=node@22.23 sha256:036052acb454…[eval]:<n> · const inst1 = plugin(api, { method: <str>, include: [<str>, <str>] }); · ^ · TypeError: plugin is not a functionnode · unclassified-diagnostic · outer node · gap stage-unknown증거 품질: complete · 환경 변형: 1 · 최초 관측: 2026-09-05 · 마지막 관측: 2026-09-05진단 재검증 후보
-
관측됨 UNKNOWN exit 1 증거 공백 ×1 8.0.0 executionContext=node · moduleSystem=cjs · os=linux · runtime=node@22.23 sha256:138a106a5937…stat main.go: no such file or directorygo · unclassified-diagnostic · outer go run · gap stage-unknown증거 품질: complete · 환경 변형: 1 · 최초 관측: 2026-09-05 · 마지막 관측: 2026-09-05진단 재검증 후보
-
관측됨 UNKNOWN exit 1 증거 공백 ×1 8.0.0 executionContext=node · moduleSystem=cjs · os=linux · runtime=node@22.23 sha256:69ab38336834…assertion 1 failed: expected text/plain; version=0.0.4; charset=utf-8, got text/plain; version=0.0.4; charset=utf-8; escaping=underscores · exit status 1go · unclassified-diagnostic · outer go run · gap stage-unknown증거 품질: complete · 환경 변형: 1 · 최초 관측: 2026-09-05 · 마지막 관측: 2026-09-05진단 재검증 후보
가장 많이 보고된 12개를 보여줍니다. 이 좌표에 기록된 실패 클러스터는 13개입니다. 나머지는 단발 보고입니다.