Registrosnpm@babel/helper-globals8.0.0
Cambiar las condiciones
Condiciones actuales
@babel/helper-globals @8.0.0debian glibc · x64 · node 22 · npm · node
total del paquete, no una API
1 de 1 pasaron
Verificado: esta red ejecutó un contrato en esta coordenada.
hay una muestra aquí y nuestra ejecución en esta coordenada terminó limpia (1)
- Observaciones de proyectos
- 2 / 2
- Verificaciones de contrato
- 1 / 1
- Registros de uso
- 2
- Peers independientes que reportaron
- 1
- Último registro
- 2026-09-07
Evidencia que puedes abrir
Salud de dependencias
Una resolución leyó el árbol de esta versión y no encontró dependencias. Es una medición, no una que falte.
Clústeres de fallos recientes
-
observado UNKNOWN exit 1 ERR_MODULE_NOT_FOUND Brecha de evidencia ×7 7.29.7 → 8.0.0 executionContext=node · os=linux · runtime=node@22.23 sha256:88af852f99a8…node:internal/modules/package_json_reader:<n> · throw new ERR_MODULE_NOT_FOUND(packageName, fileURLToPath(base), null); · ^ …node · unclassified-diagnostic · outer node · gap stage-unknownCalidad de evidencia: complete · Variantes de entorno: 2 · Primer registro: 2026-08-30 · Última observación: 2026-09-05Candidato a reverificación diagnóstica
-
observado UNKNOWN exit 1 ERR_ASSERTION Brecha de evidencia ×5 7.29.7 → 8.0.0 executionContext=node · os=linux · runtime=node@22.23 sha256:986d98189e70…node:internal/modules/run_main:<n> · triggerUncaughtException( · ^ · AssertionError [ERR_ASSERTION]: Expected values to be strictly equal:node · unclassified-diagnostic · outer node · gap stage-unknownCalidad de evidencia: complete · Variantes de entorno: 2 · Primer registro: 2026-08-30 · Última observación: 2026-09-04Candidato a reverificación diagnóstica
-
observado PROCESS_START process start failed Brecha de evidencia ×3 7.29.7 → 8.0.0 executionContext=node sha256:c12549970456…· structured-termination · gap diagnostic-missingCalidad de evidencia: partial · Variantes de entorno: 2 · Primer registro: 2026-09-05 · Última observación: 2026-09-15Candidato a reverificación diagnóstica
-
observado UNKNOWN exit 1 Brecha de evidencia ×2 8.0.0 executionContext=node · moduleSystem=esm · os=linux · runtime=node@22.23 sha256:455451e1a14e…<url>]:<n> · import babel from <str>; · ^^^^^ · SyntaxError: The requested module <str> does not provide an export named <str>node · unclassified-diagnostic · outer node · gap stage-unknownCalidad de evidencia: complete · Variantes de entorno: 1 · Primer registro: 2026-09-02 · Última observación: 2026-09-05Candidato a reverificación diagnóstica
-
observado UNKNOWN exit 1 ERR_ASSERTION Brecha de evidencia ×1 8.0.0 executionContext=node · moduleSystem=esm · os=linux · runtime=node@22.23 sha256:c713e7987e7b…node:internal/modules/run_main:<n> · triggerUncaughtException( · ^ · AssertionError [ERR_ASSERTION]: Inner visitor must handle ForOfStatementnode · unclassified-diagnostic · outer node · gap stage-unknownCalidad de evidencia: complete · Variantes de entorno: 1 · Primer registro: 2026-08-31 · Última observación: 2026-08-31Candidato a reverificación diagnóstica
-
observado UNKNOWN exit 1 Brecha de evidencia ×1 8.0.0 executionContext=node · moduleSystem=esm · os=linux · runtime=node@22.23 sha256:fb30df1477f2…<url> · assert.strictEqual(output.includes(<str>2.0.0<str>), true); · ^^^^^^^^^^^^^^^^^^^^^^^^^^^^^^^^^^^^^^^^ · SyntaxError: missing ) after argument listnode · unclassified-diagnostic · outer node · gap stage-unknownCalidad de evidencia: complete · Variantes de entorno: 1 · Primer registro: 2026-09-02 · Última observación: 2026-09-02Candidato a reverificación diagnóstica
-
observado UNKNOWN exit 1 Brecha de evidencia ×1 8.0.0 executionContext=node · moduleSystem=esm · os=linux · runtime=node@22.23 sha256:ff4ca6a168fb…fil<path>:<n> · const error = new SyntaxError(); · ^ · SyntaxError: unknown: <str> outside of function. (10:<n>)node · unclassified-diagnostic · outer node · gap stage-unknownCalidad de evidencia: complete · Variantes de entorno: 1 · Primer registro: 2026-09-02 · Última observación: 2026-09-02Candidato a reverificación diagnóstica
-
observado UNKNOWN exit 1 ERR_ASSERTION Brecha de evidencia ×1 8.0.0 executionContext=node · moduleSystem=esm · os=linux · runtime=node@22.23 sha256:963dc79aa288…node:internal/modules/run_main:<n> · triggerUncaughtException( · ^ · AssertionError [ERR_ASSERTION]: Arrow function must be converted to function expressionnode · unclassified-diagnostic · outer node · gap stage-unknownCalidad de evidencia: complete · Variantes de entorno: 1 · Primer registro: 2026-09-03 · Última observación: 2026-09-03Candidato a reverificación diagnóstica
-
observado PROJECT_RESOLVE exit 1 ×1 8.0.0 executionContext=node · moduleSystem=cjs · os=linux · runtime=node@22.23 sha256:15e1b71df43a…test_contract.go:<n>:<n>: no required module provides package golang.org/x/text/unicode/norm: go.mod file not found in current directory or any parent …go/module · resolve-diagnostic · outer go runCalidad de evidencia: complete · Variantes de entorno: 1 · Primer registro: 2026-09-05 · Última observación: 2026-09-05
-
observado UNKNOWN exit 1 Brecha de evidencia ×1 8.0.0 executionContext=node · moduleSystem=esm · os=linux · runtime=node@22.23 sha256:036052acb454…[eval]:<n> · const inst1 = plugin(api, { method: <str>, include: [<str>, <str>] }); · ^ · TypeError: plugin is not a functionnode · unclassified-diagnostic · outer node · gap stage-unknownCalidad de evidencia: complete · Variantes de entorno: 1 · Primer registro: 2026-09-05 · Última observación: 2026-09-05Candidato a reverificación diagnóstica
-
observado UNKNOWN exit 1 Brecha de evidencia ×1 8.0.0 executionContext=node · moduleSystem=cjs · os=linux · runtime=node@22.23 sha256:138a106a5937…stat main.go: no such file or directorygo · unclassified-diagnostic · outer go run · gap stage-unknownCalidad de evidencia: complete · Variantes de entorno: 1 · Primer registro: 2026-09-05 · Última observación: 2026-09-05Candidato a reverificación diagnóstica
-
observado UNKNOWN exit 1 Brecha de evidencia ×1 8.0.0 executionContext=node · moduleSystem=cjs · os=linux · runtime=node@22.23 sha256:69ab38336834…assertion 1 failed: expected text/plain; version=0.0.4; charset=utf-8, got text/plain; version=0.0.4; charset=utf-8; escaping=underscores · exit status 1go · unclassified-diagnostic · outer go run · gap stage-unknownCalidad de evidencia: complete · Variantes de entorno: 1 · Primer registro: 2026-09-05 · Última observación: 2026-09-05Candidato a reverificación diagnóstica
Se muestran los 12 más reportados de 13 grupos de fallos registrados. El resto son reportes únicos.