Registrosnpm@babel/generator8.0.0
Mudar as condições
Condições atuais
@babel/generator @8.0.0debian glibc · x64 · node 22 · npm · node
total do pacote, não uma API
Registrado como presente em projetos. Nada foi executado nesta coordenada.
Observado — builds reais de projetos reportaram desta coordenada.
há uma amostra aqui e ainda não a executamos nesta coordenada (1)
- Observações de projetos
- nada nesta coordenada
- Verificações de contrato
- nada nesta coordenada
- Registros de uso
- 9
- Peers independentes que reportaram
- 1
- Último registro
- 2026-09-07
Saúde das dependências
Combinações observadas e evidências de falha para esta versão
Primeira quebra observada
8.0.0
linux · node@22.23 · executionContext=node
7 FAIL
· stage: UNKNOWN
· fingerprint: sha256:88af852f99a8104e4bc3c23eea27ebf2990625ccabf45313970f5fd7fe56c4e2
| Biblioteca | Versão | Saúde | Medido ali | Projetos |
|---|---|---|---|---|
| @babel/parser | 8.0.4 | CANDIDATE Mudança correlacionada; combinação não comprovada | contrato aprovado | 40 dias-projeto |
| @babel/types | 8.0.4 | CANDIDATE Mudança correlacionada; combinação não comprovada | contrato aprovado | 40 dias-projeto |
| @jridgewell/gen-mapping | 0.3.13 | PASS Todas as observações passaram | contrato aprovado | 40 dias-projeto |
| @jridgewell/trace-mapping | 0.3.31 | PASS Todas as observações passaram | contrato aprovado | 40 dias-projeto |
| @types/jsesc | 2.5.1 | PASS Todas as observações passaram | contrato aprovado | 40 dias-projeto |
| jsesc | 3.1.0 | PASS Todas as observações passaram | contrato aprovado | 38 dias-projeto |
A coluna de medição é sobre a versão de cada dependência em si, não sobre o par. Um resolvedor ter colocado duas versões lado a lado não é prova de que funcionam juntas.
Versões de dependências por versão
Para que cada versão deste pacote resolveu seus filhos. O filho cuja versão se moveu vem primeiro: foi ali que uma atualização mudou algo sob os seus pés.
| Biblioteca | 8.0.0 | 7.29.8 | 7.29.7 | 7.28.5 |
|---|---|---|---|---|
| @babel/parser | 8.0.4 | 7.29.8 | 7.29.7 | 7.28.5 |
| @babel/types | 8.0.4 | 7.29.8 | 7.29.7 | 7.28.5 |
| @jridgewell/gen-mapping | 0.3.13 | 0.3.13 | 0.3.13 | 0.3.13 |
| @jridgewell/trace-mapping | 0.3.31 | 0.3.31 | 0.3.31 | 0.3.31 |
| @types/jsesc | 2.5.1 | — | — | — |
| jsesc | 3.1.0 | 3.1.0 | 3.1.0 | 3.1.0 |
Moveram-se: 2 · iguais em todas as versões: 4
Uma aresta registra que um resolvedor colocou uma versão ao lado de outra em uma máquina real. Não é uma afirmação de que as duas funcionam juntas; essa pergunta é respondida por amostras e contratos, não pela presença de uma linha.
Clusters de falha recentes
-
observado UNKNOWN exit 1 ERR_MODULE_NOT_FOUND Lacuna de evidência ×7 7.29.8 → 8.0.0 executionContext=node · os=linux · runtime=node@22.23 sha256:88af852f99a8…node:internal/modules/package_json_reader:<n> · throw new ERR_MODULE_NOT_FOUND(packageName, fileURLToPath(base), null); · ^ …node · unclassified-diagnostic · outer node · gap stage-unknownQualidade da evidência: complete · Variantes de ambiente: 2 · Primeiro registro: 2026-08-30 · Visto por último: 2026-09-05Candidato a reverificação diagnóstica
-
observado UNKNOWN exit 1 ERR_ASSERTION Lacuna de evidência ×5 7.29.8 → 8.0.0 executionContext=node · os=linux · runtime=node@22.23 sha256:986d98189e70…node:internal/modules/run_main:<n> · triggerUncaughtException( · ^ · AssertionError [ERR_ASSERTION]: Expected values to be strictly equal:node · unclassified-diagnostic · outer node · gap stage-unknownQualidade da evidência: complete · Variantes de ambiente: 2 · Primeiro registro: 2026-08-30 · Visto por último: 2026-09-04Candidato a reverificação diagnóstica
-
observado PROCESS_START process start failed Lacuna de evidência ×3 7.29.8 → 8.0.0 executionContext=node sha256:c12549970456…· structured-termination · gap diagnostic-missingQualidade da evidência: partial · Variantes de ambiente: 2 · Primeiro registro: 2026-09-05 · Visto por último: 2026-09-16Candidato a reverificação diagnóstica
-
observado UNKNOWN exit 1 Lacuna de evidência ×2 8.0.0 executionContext=node · moduleSystem=esm · os=linux · runtime=node@22.23 sha256:455451e1a14e…<url>]:<n> · import babel from <str>; · ^^^^^ · SyntaxError: The requested module <str> does not provide an export named <str>node · unclassified-diagnostic · outer node · gap stage-unknownQualidade da evidência: complete · Variantes de ambiente: 1 · Primeiro registro: 2026-09-02 · Visto por último: 2026-09-05Candidato a reverificação diagnóstica
-
observado UNKNOWN exit 1 ERR_ASSERTION Lacuna de evidência ×1 8.0.0 executionContext=node · moduleSystem=esm · os=linux · runtime=node@22.23 sha256:c713e7987e7b…node:internal/modules/run_main:<n> · triggerUncaughtException( · ^ · AssertionError [ERR_ASSERTION]: Inner visitor must handle ForOfStatementnode · unclassified-diagnostic · outer node · gap stage-unknownQualidade da evidência: complete · Variantes de ambiente: 1 · Primeiro registro: 2026-08-31 · Visto por último: 2026-08-31Candidato a reverificação diagnóstica
-
observado UNKNOWN exit 1 Lacuna de evidência ×1 8.0.0 executionContext=node · moduleSystem=esm · os=linux · runtime=node@22.23 sha256:fb30df1477f2…<url> · assert.strictEqual(output.includes(<str>2.0.0<str>), true); · ^^^^^^^^^^^^^^^^^^^^^^^^^^^^^^^^^^^^^^^^ · SyntaxError: missing ) after argument listnode · unclassified-diagnostic · outer node · gap stage-unknownQualidade da evidência: complete · Variantes de ambiente: 1 · Primeiro registro: 2026-09-02 · Visto por último: 2026-09-02Candidato a reverificação diagnóstica
-
observado UNKNOWN exit 1 Lacuna de evidência ×1 8.0.0 executionContext=node · moduleSystem=esm · os=linux · runtime=node@22.23 sha256:ff4ca6a168fb…fil<path>:<n> · const error = new SyntaxError(); · ^ · SyntaxError: unknown: <str> outside of function. (10:<n>)node · unclassified-diagnostic · outer node · gap stage-unknownQualidade da evidência: complete · Variantes de ambiente: 1 · Primeiro registro: 2026-09-02 · Visto por último: 2026-09-02Candidato a reverificação diagnóstica
-
observado UNKNOWN exit 1 ERR_ASSERTION Lacuna de evidência ×1 8.0.0 executionContext=node · moduleSystem=esm · os=linux · runtime=node@22.23 sha256:963dc79aa288…node:internal/modules/run_main:<n> · triggerUncaughtException( · ^ · AssertionError [ERR_ASSERTION]: Arrow function must be converted to function expressionnode · unclassified-diagnostic · outer node · gap stage-unknownQualidade da evidência: complete · Variantes de ambiente: 1 · Primeiro registro: 2026-09-03 · Visto por último: 2026-09-03Candidato a reverificação diagnóstica
-
observado PROJECT_RESOLVE exit 1 ×1 8.0.0 executionContext=node · moduleSystem=cjs · os=linux · runtime=node@22.23 sha256:15e1b71df43a…test_contract.go:<n>:<n>: no required module provides package golang.org/x/text/unicode/norm: go.mod file not found in current directory or any parent …go/module · resolve-diagnostic · outer go runQualidade da evidência: complete · Variantes de ambiente: 1 · Primeiro registro: 2026-09-05 · Visto por último: 2026-09-05
-
observado UNKNOWN exit 1 Lacuna de evidência ×1 8.0.0 executionContext=node · moduleSystem=esm · os=linux · runtime=node@22.23 sha256:036052acb454…[eval]:<n> · const inst1 = plugin(api, { method: <str>, include: [<str>, <str>] }); · ^ · TypeError: plugin is not a functionnode · unclassified-diagnostic · outer node · gap stage-unknownQualidade da evidência: complete · Variantes de ambiente: 1 · Primeiro registro: 2026-09-05 · Visto por último: 2026-09-05Candidato a reverificação diagnóstica
-
observado UNKNOWN exit 1 Lacuna de evidência ×1 8.0.0 executionContext=node · moduleSystem=cjs · os=linux · runtime=node@22.23 sha256:138a106a5937…stat main.go: no such file or directorygo · unclassified-diagnostic · outer go run · gap stage-unknownQualidade da evidência: complete · Variantes de ambiente: 1 · Primeiro registro: 2026-09-05 · Visto por último: 2026-09-05Candidato a reverificação diagnóstica
-
observado UNKNOWN exit 1 Lacuna de evidência ×1 8.0.0 executionContext=node · moduleSystem=cjs · os=linux · runtime=node@22.23 sha256:69ab38336834…assertion 1 failed: expected text/plain; version=0.0.4; charset=utf-8, got text/plain; version=0.0.4; charset=utf-8; escaping=underscores · exit status 1go · unclassified-diagnostic · outer go run · gap stage-unknownQualidade da evidência: complete · Variantes de ambiente: 1 · Primeiro registro: 2026-09-05 · Visto por último: 2026-09-05Candidato a reverificação diagnóstica
Mostrando os 12 mais relatados de 13 grupos de falhas registrados. O resto são relatos únicos.