Recordsgolanggo.opentelemetry.io/proto/otlpv1.5.0go.opentelemetry.io/proto/otlp/trace/v1.Span
Change the conditions
Current conditions
go.opentelemetry.io/proto/otlp/trace/v1.Span @v1.5.0ubuntu glibc · x64 · go 1.26 · go 1
5 of 6 passed
Observed — real project builds reported from this coordinate.
no sample at this coordinate yet
- Project observations
- 5 / 6
- Contract verifications
- nothing at this coordinate
- Independent reporting peers
- 1
- Last recorded
- 2026-09-02
Dependency Health
Observed combinations and failure evidence for this release
First observed break
v1.5.0
linux · go@1.26
1 FAIL
· stage: PROJECT_COMPILE
· fingerprint: sha256:089d53aa715fcac682a38976c28f89082d3b26eecd5702f323784a1bc5de5112
| Library | Version | Health | Measured there | Projects |
|---|---|---|---|---|
| github.com/grpc-ecosystem/grpc-gateway/v2 | v2.26.1 | CANDIDATE Correlated change; unproven combination | builds observed | 7 project-days |
| google.golang.org/grpc | v1.71.0 | CANDIDATE Correlated change; unproven combination | contract passed | 7 project-days |
| google.golang.org/protobuf | v1.36.5 | CANDIDATE Correlated change; unproven combination | contract passed | 7 project-days |
The measured column is about each dependency's own release, not about the pair. A resolver placing two releases side by side is not evidence that they work together.
Dependency versions across releases
What each release of this package resolved its children to. A child whose version moved is listed first: that is where an upgrade changed something underneath you.
| Library | v1.11.0 | v1.10.0 | v1.9.0 | v1.7.1 | v1.5.0 |
|---|---|---|---|---|---|
| github.com/grpc-ecosystem/grpc-gateway/v2 | v2.30.0 | v2.28.0 | v2.27.2 | v2.27.1 | v2.26.1 |
| google.golang.org/grpc | v1.83.2 | v1.81.0 | v1.75.1 | v1.74.2 | v1.71.0 |
| google.golang.org/protobuf | v1.36.12 | v1.36.11 | v1.36.12 | v1.36.12 | v1.36.5 |
Moved: 3 · unchanged at every release: 0
An edge records that a resolver placed one release beside another on a real machine. It is not a claim that the two work together; that question is answered by samples and contracts, not by presence here.
Recent failure clusters
-
observed PROJECT_COMPILE exit 1 ×1 v1.5.0 os=linux · runtime=go@1.26 sha256:089d53aa715f…<path> undefined: sdkmetric.WithAttributesgo/compiler · compiler-diagnostic · outer go testEvidence quality: complete · Environment variants: 1 · First recorded: 2026-08-31 · Last seen: 2026-08-31
-
observed PROJECT_TEST exit 1 ×1 v1.5.0 os=linux · runtime=go@1.26 sha256:68a7069b7aae…--- FAIL: TestOTLPMetricHTTPExporterContract (0.00s) · === RUN TestWithTemporalitySelectorOption · --- PASS: TestWithTemporalitySelectorOption (0.00s) …go/test · test-runner-diagnostic · outer go testEvidence quality: complete · Environment variants: 1 · First recorded: 2026-08-31 · Last seen: 2026-08-31
-
observed PROJECT_TEST exit 1 ×1 v1.5.0 os=linux · runtime=go@1.26 sha256:da67984267a5…--- FAIL: TestOTLPMetricHTTPExporter (0.00s) · FAIL test_otel 0.134sgo/test · test-runner-diagnostic · outer go testEvidence quality: complete · Environment variants: 1 · First recorded: 2026-08-31 · Last seen: 2026-08-31
-
observed PROJECT_COMPILE exit 1 ×1 v1.5.0 os=linux · runtime=go@1.26 sha256:bf7a69ae809c…test/contract.go:<n>:<n>: undefined: sdktrace.WithAttributesgo/compiler · compiler-diagnostic · outer go runEvidence quality: complete · Environment variants: 1 · First recorded: 2026-08-31 · Last seen: 2026-08-31
-
observed UNKNOWN exit 1 Evidence gap ×1 v1.5.0 os=linux · runtime=go@1.26 sha256:47275b7bc3e6…Contract test failed: expected error when ExportSpans is called after Shutdown, got nil · exit status 1go · unclassified-diagnostic · outer go run · gap stage-unknownEvidence quality: complete · Environment variants: 1 · First recorded: 2026-08-31 · Last seen: 2026-08-31Diagnostic re-verification candidate
-
observed UNKNOWN exit 1 Evidence gap ×1 v1.5.0 os=linux · runtime=go@1.26 sha256:78a56645d291…Contract test failed: client.Stop was not called on exporter Shutdown · exit status 1go · unclassified-diagnostic · outer go run · gap stage-unknownEvidence quality: complete · Environment variants: 1 · First recorded: 2026-08-31 · Last seen: 2026-08-31Diagnostic re-verification candidate
-
observed UNKNOWN exit 1 Evidence gap ×1 v1.5.0 os=linux · runtime=go@1.26 sha256:2a77dcac8561…Contract test failed: expected error when ExportSpans is called on unstarted exporter, got nil · exit status 1go · unclassified-diagnostic · outer go run · gap stage-unknownEvidence quality: complete · Environment variants: 1 · First recorded: 2026-09-01 · Last seen: 2026-09-01Diagnostic re-verification candidate
-
observed PROJECT_COMPILE exit 1 ×1 v1.5.0 os=linux · runtime=go@1.26 go.opentelemetry.io/proto/otlp/trace/v1.Span sha256:e84876b56a4e…test/contract.go:<n>:<n>: assignment mismatch: 1 variable but otlptrace.New returns 2 values …go/compiler · compiler-diagnostic · outer go runEvidence quality: complete · Environment variants: 1 · First recorded: 2026-09-02 · Last seen: 2026-09-02
-
observed PROJECT_TEST exit 1 ×1 v1.5.0 os=linux · runtime=go@1.26 sha256:4d9975558e16…--- FAIL: TestWithoutInsecureFailsPlaintext (10.00s) · FAIL example.com/otlptracegrpc-insecure/test 10.009sgo/test · test-runner-diagnostic · outer go testEvidence quality: complete · Environment variants: 1 · First recorded: 2026-09-02 · Last seen: 2026-09-02
-
observed PROJECT_TEST exit 1 ×1 v1.5.0 os=linux · runtime=go@1.26 sha256:b6b84f5f81cf…--- FAIL: TestWithInsecureContract (10.00s) · contract_test.go:<n>: expected at least one gRPC trace export request, got none …go/test · test-runner-diagnostic · outer go testEvidence quality: complete · Environment variants: 1 · First recorded: 2026-09-02 · Last seen: 2026-09-02