记录golanggo.opentelemetry.io/proto/otlpv1.5.0go.opentelemetry.io/proto/otlp/collector/trace/v1.UnimplementedTraceServiceServer
更改条件
依赖健康度
此版本的依赖组合与失败观测
观测到问题 1 项 ·
变动 3 项 ·
正常 0 项
| 库 | 版本 | 健康状态 | 在那里测得 | 项目 |
|---|---|---|---|---|
| github.com/grpc-ecosystem/grpc-gateway/v2 | v2.26.1 | CANDIDATE 相关变更;组合未证实 | 观测到构建 | 7 个项目日 |
| google.golang.org/grpc | v1.71.0 | CANDIDATE 相关变更;组合未证实 | 契约通过 | 7 个项目日 |
| google.golang.org/protobuf | v1.36.5 | CANDIDATE 相关变更;组合未证实 | 契约通过 | 7 个项目日 |
测量列说的是每个依赖自身版本的情况,而不是这一对的情况。解析器把两个版本放在一起,并不证明它们能协同工作。
各版本的依赖版本
本包的每个版本把子依赖解析到了哪个版本。版本发生变动的子依赖排在最前:升级正是在那里改变了你脚下的东西。
| 库 | v1.11.0 | v1.10.0 | v1.9.0 | v1.7.1 | v1.5.0 |
|---|---|---|---|---|---|
| github.com/grpc-ecosystem/grpc-gateway/v2 | v2.30.0 | v2.28.0 | v2.27.2 | v2.27.1 | v2.26.1 |
| google.golang.org/grpc | v1.83.2 | v1.81.0 | v1.75.1 | v1.74.2 | v1.71.0 |
| google.golang.org/protobuf | v1.36.12 | v1.36.11 | v1.36.12 | v1.36.12 | v1.36.5 |
发生变动:3 · 所有版本相同:0
一条边记录的是解析器在真实机器上把一个版本放在了另一个版本旁边。它并不主张两者能协同工作;那个问题由样本和契约回答,而不是由这里存在一行来回答。
近期失败聚类
-
已观测 PROJECT_COMPILE exit 1 ×1 v1.5.0 os=linux · runtime=go@1.26 sha256:089d53aa715f…<path> undefined: sdkmetric.WithAttributesgo/compiler · compiler-diagnostic · outer go test证据质量: complete · 环境变体: 1 · 首次记录: 2026-08-31 · 最近观测: 2026-08-31
-
已观测 PROJECT_TEST exit 1 ×1 v1.5.0 os=linux · runtime=go@1.26 sha256:68a7069b7aae…--- FAIL: TestOTLPMetricHTTPExporterContract (0.00s) · === RUN TestWithTemporalitySelectorOption · --- PASS: TestWithTemporalitySelectorOption (0.00s) …go/test · test-runner-diagnostic · outer go test证据质量: complete · 环境变体: 1 · 首次记录: 2026-08-31 · 最近观测: 2026-08-31
-
已观测 PROJECT_TEST exit 1 ×1 v1.5.0 os=linux · runtime=go@1.26 sha256:da67984267a5…--- FAIL: TestOTLPMetricHTTPExporter (0.00s) · FAIL test_otel 0.134sgo/test · test-runner-diagnostic · outer go test证据质量: complete · 环境变体: 1 · 首次记录: 2026-08-31 · 最近观测: 2026-08-31
-
已观测 PROJECT_COMPILE exit 1 ×1 v1.5.0 os=linux · runtime=go@1.26 sha256:bf7a69ae809c…test/contract.go:<n>:<n>: undefined: sdktrace.WithAttributesgo/compiler · compiler-diagnostic · outer go run证据质量: complete · 环境变体: 1 · 首次记录: 2026-08-31 · 最近观测: 2026-08-31
-
已观测 UNKNOWN exit 1 证据缺口 ×1 v1.5.0 os=linux · runtime=go@1.26 sha256:47275b7bc3e6…Contract test failed: expected error when ExportSpans is called after Shutdown, got nil · exit status 1go · unclassified-diagnostic · outer go run · gap stage-unknown证据质量: complete · 环境变体: 1 · 首次记录: 2026-08-31 · 最近观测: 2026-08-31诊断复验候选
-
已观测 UNKNOWN exit 1 证据缺口 ×1 v1.5.0 os=linux · runtime=go@1.26 sha256:78a56645d291…Contract test failed: client.Stop was not called on exporter Shutdown · exit status 1go · unclassified-diagnostic · outer go run · gap stage-unknown证据质量: complete · 环境变体: 1 · 首次记录: 2026-08-31 · 最近观测: 2026-08-31诊断复验候选
-
已观测 UNKNOWN exit 1 证据缺口 ×1 v1.5.0 os=linux · runtime=go@1.26 sha256:2a77dcac8561…Contract test failed: expected error when ExportSpans is called on unstarted exporter, got nil · exit status 1go · unclassified-diagnostic · outer go run · gap stage-unknown证据质量: complete · 环境变体: 1 · 首次记录: 2026-09-01 · 最近观测: 2026-09-01诊断复验候选
-
已观测 PROJECT_COMPILE exit 1 ×1 v1.5.0 os=linux · runtime=go@1.26 go.opentelemetry.io/proto/otlp/collector/trace/v1.UnimplementedTraceServiceServer sha256:e84876b56a4e…test/contract.go:<n>:<n>: assignment mismatch: 1 variable but otlptrace.New returns 2 values …go/compiler · compiler-diagnostic · outer go run证据质量: complete · 环境变体: 1 · 首次记录: 2026-09-02 · 最近观测: 2026-09-02
-
已观测 PROJECT_TEST exit 1 ×1 v1.5.0 os=linux · runtime=go@1.26 sha256:4d9975558e16…--- FAIL: TestWithoutInsecureFailsPlaintext (10.00s) · FAIL example.com/otlptracegrpc-insecure/test 10.009sgo/test · test-runner-diagnostic · outer go test证据质量: complete · 环境变体: 1 · 首次记录: 2026-09-02 · 最近观测: 2026-09-02
-
已观测 PROJECT_TEST exit 1 ×1 v1.5.0 os=linux · runtime=go@1.26 sha256:b6b84f5f81cf…--- FAIL: TestWithInsecureContract (10.00s) · contract_test.go:<n>: expected at least one gRPC trace export request, got none …go/test · test-runner-diagnostic · outer go test证据质量: complete · 环境变体: 1 · 首次记录: 2026-09-02 · 最近观测: 2026-09-02