記録golanggo.opentelemetry.io/proto/otlpv1.5.0go.opentelemetry.io/proto/otlp/collector/trace/v1.ExportTraceServiceRequest
条件を変更
現在の条件
go.opentelemetry.io/proto/otlp/collector/trace/v1.ExportTraceServiceRequest @v1.5.0ubuntu glibc · x64 · go 1.26 · go 1
6 回中 5 回が成功
観測 — 実際のプロジェクトのビルドがこの座標から報告されました。
この座標にはまだサンプルがない
- プロジェクト観測
- 5 / 6
- コントラクト検証
- この座標にはなし
- 独立した報告ピア
- 1
- 最終記録
- 2026-09-02
開ける証拠
依存関係のヘルス
このリリースの依存関係の組み合わせと失敗観測
観測された問題 1件 ·
変更 3件 ·
正常 0件
| ライブラリ | バージョン | ヘルス | その座標で測定されたこと | プロジェクト |
|---|---|---|---|---|
| github.com/grpc-ecosystem/grpc-gateway/v2 | v2.26.1 | CANDIDATE 相関変更; 組み合わせ未証明 | ビルド観測済み | プロジェクト日 7 件 |
| google.golang.org/grpc | v1.71.0 | CANDIDATE 相関変更; 組み合わせ未証明 | コントラクト合格 | プロジェクト日 7 件 |
| google.golang.org/protobuf | v1.36.5 | CANDIDATE 相関変更; 組み合わせ未証明 | コントラクト合格 | プロジェクト日 7 件 |
測定列は各依存関係自身のリリースに関するもので、2つのリリースの組み合わせに関するものではありません。リゾルバが2つを並べたという事実は、両者が協調して動く証拠ではありません。
リリースごとの依存バージョン
このパッケージの各リリースが子をどのバージョンに解決したかです。バージョンが動いた子が先に並びます — アップグレードが足元で何かを変えた地点です。
| ライブラリ | v1.11.0 | v1.10.0 | v1.9.0 | v1.7.1 | v1.5.0 |
|---|---|---|---|---|---|
| github.com/grpc-ecosystem/grpc-gateway/v2 | v2.30.0 | v2.28.0 | v2.27.2 | v2.27.1 | v2.26.1 |
| google.golang.org/grpc | v1.83.2 | v1.81.0 | v1.75.1 | v1.74.2 | v1.71.0 |
| google.golang.org/protobuf | v1.36.12 | v1.36.11 | v1.36.12 | v1.36.12 | v1.36.5 |
変動: 3 · 全リリースで同一: 0
エッジは、実機でリゾルバがあるリリースを別のリリースの隣に置いたという記録です。両者が一緒に動くという主張ではありません。その問いに答えるのは、ここに行があることではなくサンプルと契約です。
最近の失敗クラスター
-
観測済み PROJECT_COMPILE exit 1 ×1 v1.5.0 os=linux · runtime=go@1.26 sha256:089d53aa715f…<path> undefined: sdkmetric.WithAttributesgo/compiler · compiler-diagnostic · outer go test証拠品質: complete · 環境バリアント: 1 · 初回記録: 2026-08-31 · 最終観測: 2026-08-31
-
観測済み PROJECT_TEST exit 1 ×1 v1.5.0 os=linux · runtime=go@1.26 sha256:68a7069b7aae…--- FAIL: TestOTLPMetricHTTPExporterContract (0.00s) · === RUN TestWithTemporalitySelectorOption · --- PASS: TestWithTemporalitySelectorOption (0.00s) …go/test · test-runner-diagnostic · outer go test証拠品質: complete · 環境バリアント: 1 · 初回記録: 2026-08-31 · 最終観測: 2026-08-31
-
観測済み PROJECT_TEST exit 1 ×1 v1.5.0 os=linux · runtime=go@1.26 sha256:da67984267a5…--- FAIL: TestOTLPMetricHTTPExporter (0.00s) · FAIL test_otel 0.134sgo/test · test-runner-diagnostic · outer go test証拠品質: complete · 環境バリアント: 1 · 初回記録: 2026-08-31 · 最終観測: 2026-08-31
-
観測済み PROJECT_COMPILE exit 1 ×1 v1.5.0 os=linux · runtime=go@1.26 sha256:bf7a69ae809c…test/contract.go:<n>:<n>: undefined: sdktrace.WithAttributesgo/compiler · compiler-diagnostic · outer go run証拠品質: complete · 環境バリアント: 1 · 初回記録: 2026-08-31 · 最終観測: 2026-08-31
-
観測済み UNKNOWN exit 1 証拠の欠落 ×1 v1.5.0 os=linux · runtime=go@1.26 sha256:47275b7bc3e6…Contract test failed: expected error when ExportSpans is called after Shutdown, got nil · exit status 1go · unclassified-diagnostic · outer go run · gap stage-unknown証拠品質: complete · 環境バリアント: 1 · 初回記録: 2026-08-31 · 最終観測: 2026-08-31診断再検証候補
-
観測済み UNKNOWN exit 1 証拠の欠落 ×1 v1.5.0 os=linux · runtime=go@1.26 sha256:78a56645d291…Contract test failed: client.Stop was not called on exporter Shutdown · exit status 1go · unclassified-diagnostic · outer go run · gap stage-unknown証拠品質: complete · 環境バリアント: 1 · 初回記録: 2026-08-31 · 最終観測: 2026-08-31診断再検証候補
-
観測済み UNKNOWN exit 1 証拠の欠落 ×1 v1.5.0 os=linux · runtime=go@1.26 sha256:2a77dcac8561…Contract test failed: expected error when ExportSpans is called on unstarted exporter, got nil · exit status 1go · unclassified-diagnostic · outer go run · gap stage-unknown証拠品質: complete · 環境バリアント: 1 · 初回記録: 2026-09-01 · 最終観測: 2026-09-01診断再検証候補
-
観測済み PROJECT_COMPILE exit 1 ×1 v1.5.0 os=linux · runtime=go@1.26 go.opentelemetry.io/proto/otlp/collector/trace/v1.ExportTraceServiceRequest sha256:e84876b56a4e…test/contract.go:<n>:<n>: assignment mismatch: 1 variable but otlptrace.New returns 2 values …go/compiler · compiler-diagnostic · outer go run証拠品質: complete · 環境バリアント: 1 · 初回記録: 2026-09-02 · 最終観測: 2026-09-02
-
観測済み PROJECT_TEST exit 1 ×1 v1.5.0 os=linux · runtime=go@1.26 sha256:4d9975558e16…--- FAIL: TestWithoutInsecureFailsPlaintext (10.00s) · FAIL example.com/otlptracegrpc-insecure/test 10.009sgo/test · test-runner-diagnostic · outer go test証拠品質: complete · 環境バリアント: 1 · 初回記録: 2026-09-02 · 最終観測: 2026-09-02
-
観測済み PROJECT_TEST exit 1 ×1 v1.5.0 os=linux · runtime=go@1.26 sha256:b6b84f5f81cf…--- FAIL: TestWithInsecureContract (10.00s) · contract_test.go:<n>: expected at least one gRPC trace export request, got none …go/test · test-runner-diagnostic · outer go test証拠品質: complete · 環境バリアント: 1 · 初回記録: 2026-09-02 · 最終観測: 2026-09-02