Registrosgolanggo.opentelemetry.io/proto/otlpv1.5.0go.opentelemetry.io/proto/otlp/trace/v1.Span
Mudar as condições
Condições atuais
go.opentelemetry.io/proto/otlp/trace/v1.Span @v1.5.0linux · glibc · x64 · go 1.26 · go 1
5 de 6 passaram
Observado — builds reais de projetos reportaram desta coordenada.
ainda sem amostra nesta coordenada
- Observações de projetos
- 5 / 6
- Verificações de contrato
- nada nesta coordenada
- Peers independentes que reportaram
- 1
- Último registro
- 2026-09-02
Saúde das dependências
Combinações observadas e evidências de falha para esta versão
Primeira quebra observada
v1.5.0
linux · go@1.26
1 FAIL
· stage: PROJECT_COMPILE
· fingerprint: sha256:089d53aa715fcac682a38976c28f89082d3b26eecd5702f323784a1bc5de5112
| Biblioteca | Versão | Saúde | Medido ali | Projetos |
|---|---|---|---|---|
| github.com/grpc-ecosystem/grpc-gateway/v2 | v2.26.1 | CANDIDATE Mudança correlacionada; combinação não comprovada | builds observados | 7 dias-projeto |
| google.golang.org/grpc | v1.71.0 | CANDIDATE Mudança correlacionada; combinação não comprovada | contrato aprovado | 7 dias-projeto |
| google.golang.org/protobuf | v1.36.5 | CANDIDATE Mudança correlacionada; combinação não comprovada | contrato aprovado | 7 dias-projeto |
A coluna de medição é sobre a versão de cada dependência em si, não sobre o par. Um resolvedor ter colocado duas versões lado a lado não é prova de que funcionam juntas.
Versões de dependências por versão
Para que cada versão deste pacote resolveu seus filhos. O filho cuja versão se moveu vem primeiro: foi ali que uma atualização mudou algo sob os seus pés.
| Biblioteca | v1.11.0 | v1.10.0 | v1.9.0 | v1.7.1 | v1.5.0 |
|---|---|---|---|---|---|
| github.com/grpc-ecosystem/grpc-gateway/v2 | v2.30.0 | v2.28.0 | v2.27.2 | v2.27.1 | v2.26.1 |
| google.golang.org/grpc | v1.83.2 | v1.81.0 | v1.75.1 | v1.74.2 | v1.71.0 |
| google.golang.org/protobuf | v1.36.12 | v1.36.11 | v1.36.12 | v1.36.12 | v1.36.5 |
Moveram-se: 3 · iguais em todas as versões: 0
Uma aresta registra que um resolvedor colocou uma versão ao lado de outra em uma máquina real. Não é uma afirmação de que as duas funcionam juntas; essa pergunta é respondida por amostras e contratos, não pela presença de uma linha.
Clusters de falha recentes
-
observado PROJECT_COMPILE exit 1 ×1 v1.5.0 os=linux · runtime=go@1.26 sha256:089d53aa715f…<path> undefined: sdkmetric.WithAttributesgo/compiler · compiler-diagnostic · outer go testQualidade da evidência: complete · Variantes de ambiente: 1 · Primeiro registro: 2026-08-31 · Visto por último: 2026-08-31
-
observado PROJECT_TEST exit 1 ×1 v1.5.0 os=linux · runtime=go@1.26 sha256:68a7069b7aae…--- FAIL: TestOTLPMetricHTTPExporterContract (0.00s) · === RUN TestWithTemporalitySelectorOption · --- PASS: TestWithTemporalitySelectorOption (0.00s) …go/test · test-runner-diagnostic · outer go testQualidade da evidência: complete · Variantes de ambiente: 1 · Primeiro registro: 2026-08-31 · Visto por último: 2026-08-31
-
observado PROJECT_TEST exit 1 ×1 v1.5.0 os=linux · runtime=go@1.26 sha256:da67984267a5…--- FAIL: TestOTLPMetricHTTPExporter (0.00s) · FAIL test_otel 0.134sgo/test · test-runner-diagnostic · outer go testQualidade da evidência: complete · Variantes de ambiente: 1 · Primeiro registro: 2026-08-31 · Visto por último: 2026-08-31
-
observado PROJECT_COMPILE exit 1 ×1 v1.5.0 os=linux · runtime=go@1.26 sha256:bf7a69ae809c…test/contract.go:<n>:<n>: undefined: sdktrace.WithAttributesgo/compiler · compiler-diagnostic · outer go runQualidade da evidência: complete · Variantes de ambiente: 1 · Primeiro registro: 2026-08-31 · Visto por último: 2026-08-31
-
observado UNKNOWN exit 1 Lacuna de evidência ×1 v1.5.0 os=linux · runtime=go@1.26 sha256:47275b7bc3e6…Contract test failed: expected error when ExportSpans is called after Shutdown, got nil · exit status 1go · unclassified-diagnostic · outer go run · gap stage-unknownQualidade da evidência: complete · Variantes de ambiente: 1 · Primeiro registro: 2026-08-31 · Visto por último: 2026-08-31Candidato a reverificação diagnóstica
-
observado UNKNOWN exit 1 Lacuna de evidência ×1 v1.5.0 os=linux · runtime=go@1.26 sha256:78a56645d291…Contract test failed: client.Stop was not called on exporter Shutdown · exit status 1go · unclassified-diagnostic · outer go run · gap stage-unknownQualidade da evidência: complete · Variantes de ambiente: 1 · Primeiro registro: 2026-08-31 · Visto por último: 2026-08-31Candidato a reverificação diagnóstica
-
observado UNKNOWN exit 1 Lacuna de evidência ×1 v1.5.0 os=linux · runtime=go@1.26 sha256:2a77dcac8561…Contract test failed: expected error when ExportSpans is called on unstarted exporter, got nil · exit status 1go · unclassified-diagnostic · outer go run · gap stage-unknownQualidade da evidência: complete · Variantes de ambiente: 1 · Primeiro registro: 2026-09-01 · Visto por último: 2026-09-01Candidato a reverificação diagnóstica
-
observado PROJECT_COMPILE exit 1 ×1 v1.5.0 os=linux · runtime=go@1.26 go.opentelemetry.io/proto/otlp/trace/v1.Span sha256:e84876b56a4e…test/contract.go:<n>:<n>: assignment mismatch: 1 variable but otlptrace.New returns 2 values …go/compiler · compiler-diagnostic · outer go runQualidade da evidência: complete · Variantes de ambiente: 1 · Primeiro registro: 2026-09-02 · Visto por último: 2026-09-02
-
observado PROJECT_TEST exit 1 ×1 v1.5.0 os=linux · runtime=go@1.26 sha256:4d9975558e16…--- FAIL: TestWithoutInsecureFailsPlaintext (10.00s) · FAIL example.com/otlptracegrpc-insecure/test 10.009sgo/test · test-runner-diagnostic · outer go testQualidade da evidência: complete · Variantes de ambiente: 1 · Primeiro registro: 2026-09-02 · Visto por último: 2026-09-02
-
observado PROJECT_TEST exit 1 ×1 v1.5.0 os=linux · runtime=go@1.26 sha256:b6b84f5f81cf…--- FAIL: TestWithInsecureContract (10.00s) · contract_test.go:<n>: expected at least one gRPC trace export request, got none …go/test · test-runner-diagnostic · outer go testQualidade da evidência: complete · Variantes de ambiente: 1 · Primeiro registro: 2026-09-02 · Visto por último: 2026-09-02