Registrosgolanggo.opentelemetry.io/proto/otlpv1.5.0
Cambiar las condiciones
Condiciones actuales
go.opentelemetry.io/proto/otlp @v1.5.0debian glibc · x64 · go 1.26 · go · go
total del paquete, no una API
Registrado como presente en proyectos. No se ejecutó nada en esta coordenada.
Observado: builds reales de proyectos reportaron desde esta coordenada.
todavía no hay muestra en esta coordenada
- Observaciones de proyectos
- nada en esta coordenada
- Verificaciones de contrato
- nada en esta coordenada
- Registros de uso
- 3
- Peers independientes que reportaron
- 1
- Último registro
- 2026-09-03
Salud de dependencias
Combinaciones observadas y evidencia de fallos para esta versión
Primer fallo observado
v1.5.0
linux · go@1.26
1 FAIL
· stage: PROJECT_COMPILE
· fingerprint: sha256:089d53aa715fcac682a38976c28f89082d3b26eecd5702f323784a1bc5de5112
| Biblioteca | Versión | Estado | Medido allí | Proyectos |
|---|---|---|---|---|
| github.com/grpc-ecosystem/grpc-gateway/v2 | v2.26.1 | CANDIDATE Cambio correlacionado; combinación no probada | compilaciones observadas | 7 días-proyecto |
| google.golang.org/grpc | v1.71.0 | CANDIDATE Cambio correlacionado; combinación no probada | contrato aprobado | 7 días-proyecto |
| google.golang.org/protobuf | v1.36.5 | CANDIDATE Cambio correlacionado; combinación no probada | contrato aprobado | 7 días-proyecto |
La columna de medición se refiere a la versión de cada dependencia en sí, no al par. Que un resolutor haya colocado dos versiones juntas no prueba que funcionen juntas.
Versiones de dependencias por versión
A qué resolvió sus hijos cada versión de este paquete. Primero va el hijo cuya versión se movió: ahí una actualización cambió algo bajo tus pies.
| Biblioteca | v1.11.0 | v1.10.0 | v1.9.0 | v1.7.1 | v1.5.0 |
|---|---|---|---|---|---|
| github.com/grpc-ecosystem/grpc-gateway/v2 | v2.30.0 | v2.28.0 | v2.27.2 | v2.27.1 | v2.26.1 |
| google.golang.org/grpc | v1.83.2 | v1.81.0 | v1.75.1 | v1.74.2 | v1.71.0 |
| google.golang.org/protobuf | v1.36.12 | v1.36.11 | v1.36.12 | v1.36.12 | v1.36.5 |
Se movieron: 3 · iguales en todas las versiones: 0
Una arista registra que un resolutor colocó una versión junto a otra en una máquina real. No afirma que ambas funcionen juntas; a esa pregunta responden las muestras y los contratos, no la presencia de una fila.
Clústeres de fallos recientes
-
observado PROJECT_COMPILE exit 1 ×1 v1.5.0 os=linux · runtime=go@1.26 sha256:089d53aa715f…<path> undefined: sdkmetric.WithAttributesgo/compiler · compiler-diagnostic · outer go testCalidad de evidencia: complete · Variantes de entorno: 1 · Primer registro: 2026-08-31 · Última observación: 2026-08-31
-
observado PROJECT_TEST exit 1 ×1 v1.5.0 os=linux · runtime=go@1.26 sha256:68a7069b7aae…--- FAIL: TestOTLPMetricHTTPExporterContract (0.00s) · === RUN TestWithTemporalitySelectorOption · --- PASS: TestWithTemporalitySelectorOption (0.00s) …go/test · test-runner-diagnostic · outer go testCalidad de evidencia: complete · Variantes de entorno: 1 · Primer registro: 2026-08-31 · Última observación: 2026-08-31
-
observado PROJECT_TEST exit 1 ×1 v1.5.0 os=linux · runtime=go@1.26 sha256:da67984267a5…--- FAIL: TestOTLPMetricHTTPExporter (0.00s) · FAIL test_otel 0.134sgo/test · test-runner-diagnostic · outer go testCalidad de evidencia: complete · Variantes de entorno: 1 · Primer registro: 2026-08-31 · Última observación: 2026-08-31
-
observado PROJECT_COMPILE exit 1 ×1 v1.5.0 os=linux · runtime=go@1.26 sha256:bf7a69ae809c…test/contract.go:<n>:<n>: undefined: sdktrace.WithAttributesgo/compiler · compiler-diagnostic · outer go runCalidad de evidencia: complete · Variantes de entorno: 1 · Primer registro: 2026-08-31 · Última observación: 2026-08-31
-
observado UNKNOWN exit 1 Brecha de evidencia ×1 v1.5.0 os=linux · runtime=go@1.26 sha256:47275b7bc3e6…Contract test failed: expected error when ExportSpans is called after Shutdown, got nil · exit status 1go · unclassified-diagnostic · outer go run · gap stage-unknownCalidad de evidencia: complete · Variantes de entorno: 1 · Primer registro: 2026-08-31 · Última observación: 2026-08-31Candidato a reverificación diagnóstica
-
observado UNKNOWN exit 1 Brecha de evidencia ×1 v1.5.0 os=linux · runtime=go@1.26 sha256:78a56645d291…Contract test failed: client.Stop was not called on exporter Shutdown · exit status 1go · unclassified-diagnostic · outer go run · gap stage-unknownCalidad de evidencia: complete · Variantes de entorno: 1 · Primer registro: 2026-08-31 · Última observación: 2026-08-31Candidato a reverificación diagnóstica
-
observado UNKNOWN exit 1 Brecha de evidencia ×1 v1.5.0 os=linux · runtime=go@1.26 sha256:2a77dcac8561…Contract test failed: expected error when ExportSpans is called on unstarted exporter, got nil · exit status 1go · unclassified-diagnostic · outer go run · gap stage-unknownCalidad de evidencia: complete · Variantes de entorno: 1 · Primer registro: 2026-09-01 · Última observación: 2026-09-01Candidato a reverificación diagnóstica
-
observado PROJECT_COMPILE exit 1 ×1 v1.5.0 os=linux · runtime=go@1.26 sha256:e84876b56a4e…test/contract.go:<n>:<n>: assignment mismatch: 1 variable but otlptrace.New returns 2 values …go/compiler · compiler-diagnostic · outer go runCalidad de evidencia: complete · Variantes de entorno: 1 · Primer registro: 2026-09-02 · Última observación: 2026-09-02
-
observado PROJECT_TEST exit 1 ×1 v1.5.0 os=linux · runtime=go@1.26 sha256:4d9975558e16…--- FAIL: TestWithoutInsecureFailsPlaintext (10.00s) · FAIL example.com/otlptracegrpc-insecure/test 10.009sgo/test · test-runner-diagnostic · outer go testCalidad de evidencia: complete · Variantes de entorno: 1 · Primer registro: 2026-09-02 · Última observación: 2026-09-02
-
observado PROJECT_TEST exit 1 ×1 v1.5.0 os=linux · runtime=go@1.26 sha256:b6b84f5f81cf…--- FAIL: TestWithInsecureContract (10.00s) · contract_test.go:<n>: expected at least one gRPC trace export request, got none …go/test · test-runner-diagnostic · outer go testCalidad de evidencia: complete · Variantes de entorno: 1 · Primer registro: 2026-09-02 · Última observación: 2026-09-02