Registrosgolanggo.opentelemetry.io/auto/sdkv1.1.0
Cambiar las condiciones
Condiciones actuales
go.opentelemetry.io/auto/sdk @v1.1.0alpine musl · x64 · go 1.26 · gomod · go
total del paquete, no una API
Registrado como presente en proyectos. No se ejecutó nada en esta coordenada.
Observado: builds reales de proyectos reportaron desde esta coordenada.
hay una muestra aquí y todavía no la hemos ejecutado en esta coordenada (3)
- Observaciones de proyectos
- nada en esta coordenada
- Verificaciones de contrato
- nada en esta coordenada
- Registros de uso
- 1
- Peers independientes que reportaron
- 1
- Último registro
- 2026-09-08
Salud de dependencias
Combinaciones observadas y evidencia de fallos para esta versión
Primer fallo observado
v1.1.0
go@1.26
19 FAIL · stage: PROJECT_TEST
| Biblioteca | Versión | Estado | Medido allí | Proyectos |
|---|---|---|---|---|
| github.com/stretchr/testify | v1.10.0 | CANDIDATE Cambio correlacionado; combinación no probada | compilaciones observadas | 40 días-proyecto |
| github.com/stretchr/testify | v1.11.1 | CANDIDATE Cambio correlacionado; combinación no probada | contrato aprobado | 6 días-proyecto |
| go.opentelemetry.io/otel | v1.34.0 | CANDIDATE Cambio correlacionado; combinación no probada | contrato aprobado | 3 días-proyecto |
| go.opentelemetry.io/otel | v1.35.0 | CANDIDATE Cambio correlacionado; combinación no probada | contrato aprobado | 7 días-proyecto |
| go.opentelemetry.io/otel | v1.37.0 | CANDIDATE Cambio correlacionado; combinación no probada | contrato aprobado | 44 días-proyecto |
| go.opentelemetry.io/otel/trace | v1.34.0 | CANDIDATE Cambio correlacionado; combinación no probada | compilaciones observadas | 3 días-proyecto |
| go.opentelemetry.io/otel/trace | v1.35.0 | CANDIDATE Cambio correlacionado; combinación no probada | contrato aprobado | 7 días-proyecto |
| go.opentelemetry.io/otel/trace | v1.37.0 | CANDIDATE Cambio correlacionado; combinación no probada | contrato aprobado | 44 días-proyecto |
La columna de medición se refiere a la versión de cada dependencia en sí, no al par. Que un resolutor haya colocado dos versiones juntas no prueba que funcionen juntas.
Versiones de dependencias por versión
A qué resolvió sus hijos cada versión de este paquete. Primero va el hijo cuya versión se movió: ahí una actualización cambió algo bajo tus pies.
| Biblioteca | v1.2.1 | v1.1.0 |
|---|---|---|
| github.com/stretchr/testify | v1.12.1 | v1.11.1 |
| go.opentelemetry.io/otel | v1.44.0 | v1.34.0 |
| go.opentelemetry.io/otel/trace | v1.44.0 | v1.34.0 |
Se movieron: 3 · iguales en todas las versiones: 0
Una arista registra que un resolutor colocó una versión junto a otra en una máquina real. No afirma que ambas funcionen juntas; a esa pregunta responden las muestras y los contratos, no la presencia de una fila.
Clústeres de fallos recientes
-
observado PROJECT_TEST Brecha de evidencia ×19 v1.1.0 → v1.2.1 runtime=go@1.26Calidad de evidencia: legacy-evidence-incomplete · Variantes de entorno: 2 · Primer registro: 2026-08-17 · Última observación: 2026-08-20Candidato a reverificación diagnóstica
-
observado PROJECT_COMPILE exit 1 ×1 v1.1.0 os=linux · runtime=go@1.26 sha256:089d53aa715f…<path> undefined: sdkmetric.WithAttributesgo/compiler · compiler-diagnostic · outer go testCalidad de evidencia: complete · Variantes de entorno: 1 · Primer registro: 2026-08-31 · Última observación: 2026-08-31
-
observado PROJECT_TEST exit 1 ×1 v1.1.0 os=linux · runtime=go@1.26 sha256:68a7069b7aae…--- FAIL: TestOTLPMetricHTTPExporterContract (0.00s) · === RUN TestWithTemporalitySelectorOption · --- PASS: TestWithTemporalitySelectorOption (0.00s) …go/test · test-runner-diagnostic · outer go testCalidad de evidencia: complete · Variantes de entorno: 1 · Primer registro: 2026-08-31 · Última observación: 2026-08-31
-
observado PROJECT_TEST exit 1 ×1 v1.1.0 os=linux · runtime=go@1.26 sha256:da67984267a5…--- FAIL: TestOTLPMetricHTTPExporter (0.00s) · FAIL test_otel 0.134sgo/test · test-runner-diagnostic · outer go testCalidad de evidencia: complete · Variantes de entorno: 1 · Primer registro: 2026-08-31 · Última observación: 2026-08-31
-
observado UNKNOWN exit 1 Brecha de evidencia ×1 v1.1.0 os=linux · runtime=go@1.26 sha256:2a77dcac8561…Contract test failed: expected error when ExportSpans is called on unstarted exporter, got nil · exit status 1go · unclassified-diagnostic · outer go run · gap stage-unknownCalidad de evidencia: complete · Variantes de entorno: 1 · Primer registro: 2026-09-01 · Última observación: 2026-09-01Candidato a reverificación diagnóstica
-
observado PROJECT_COMPILE exit 1 ×1 v1.1.0 os=linux · runtime=go@1.26 sha256:e84876b56a4e…test/contract.go:<n>:<n>: assignment mismatch: 1 variable but otlptrace.New returns 2 values …go/compiler · compiler-diagnostic · outer go runCalidad de evidencia: complete · Variantes de entorno: 1 · Primer registro: 2026-09-02 · Última observación: 2026-09-02
-
observado PROJECT_TEST exit 1 ×1 v1.1.0 os=linux · runtime=go@1.26 sha256:4d9975558e16…--- FAIL: TestWithoutInsecureFailsPlaintext (10.00s) · FAIL example.com/otlptracegrpc-insecure/test 10.009sgo/test · test-runner-diagnostic · outer go testCalidad de evidencia: complete · Variantes de entorno: 1 · Primer registro: 2026-09-02 · Última observación: 2026-09-02
-
observado PROJECT_TEST exit 1 ×1 v1.1.0 os=linux · runtime=go@1.26 sha256:b6b84f5f81cf…--- FAIL: TestWithInsecureContract (10.00s) · contract_test.go:<n>: expected at least one gRPC trace export request, got none …go/test · test-runner-diagnostic · outer go testCalidad de evidencia: complete · Variantes de entorno: 1 · Primer registro: 2026-09-02 · Última observación: 2026-09-02