Relevésgolanggo.opentelemetry.io/auto/sdkv1.1.0go.opentelemetry.io/auto/sdk.TracerProvider
Changer les conditions
Conditions actuelles
go.opentelemetry.io/auto/sdk.TracerProvider @v1.1.0alpine musl · x64 · go 1.26 · go · go
1 sur 1 ont réussi
Vérifié — ce réseau a exécuté un contrat à cette coordonnée.
il y a un échantillon ici et notre exécution à cette coordonnée s'est terminée proprement (3)
- Observations de projets
- rien à cette coordonnée
- Vérifications de contrat
- 1 / 1
- Dernier enregistrement
- 2026-08-27
Santé des dépendances
Combinaisons observées et preuves d'échec pour cette version
Premier échec observé
v1.1.0
go@1.26
19 FAIL · stage: PROJECT_TEST
| Bibliothèque | Version | Santé | Mesuré là-bas | Projets |
|---|---|---|---|---|
| github.com/stretchr/testify | v1.10.0 | CANDIDATE Changement corrélé; combinaison non prouvée | builds observés | 40 jours-projet |
| github.com/stretchr/testify | v1.11.1 | CANDIDATE Changement corrélé; combinaison non prouvée | contrat réussi | 6 jours-projet |
| go.opentelemetry.io/otel | v1.34.0 | CANDIDATE Changement corrélé; combinaison non prouvée | contrat réussi | 3 jours-projet |
| go.opentelemetry.io/otel | v1.35.0 | CANDIDATE Changement corrélé; combinaison non prouvée | contrat réussi | 7 jours-projet |
| go.opentelemetry.io/otel | v1.37.0 | CANDIDATE Changement corrélé; combinaison non prouvée | contrat réussi | 44 jours-projet |
| go.opentelemetry.io/otel/trace | v1.34.0 | CANDIDATE Changement corrélé; combinaison non prouvée | builds observés | 3 jours-projet |
| go.opentelemetry.io/otel/trace | v1.35.0 | CANDIDATE Changement corrélé; combinaison non prouvée | contrat réussi | 7 jours-projet |
| go.opentelemetry.io/otel/trace | v1.37.0 | CANDIDATE Changement corrélé; combinaison non prouvée | contrat réussi | 44 jours-projet |
La colonne de mesure porte sur la version de chaque dépendance elle-même, pas sur la paire. Qu'un résolveur ait placé deux versions côte à côte ne prouve pas qu'elles fonctionnent ensemble.
Versions des dépendances au fil des versions
Ce vers quoi chaque version de ce paquet a résolu ses enfants. L'enfant dont la version a bougé vient en premier : c'est là qu'une mise à jour a changé quelque chose sous vos pieds.
| Bibliothèque | v1.2.1 | v1.1.0 |
|---|---|---|
| github.com/stretchr/testify | v1.12.1 | v1.11.1 |
| go.opentelemetry.io/otel | v1.44.0 | v1.34.0 |
| go.opentelemetry.io/otel/trace | v1.44.0 | v1.34.0 |
Ont bougé : 3 · identiques à chaque version : 0
Une arête indique qu'un résolveur a placé une version à côté d'une autre sur une machine réelle. Ce n'est pas une affirmation qu'elles fonctionnent ensemble ; à cette question répondent les échantillons et les contrats, pas la présence d'une ligne.
Clusters d'échecs récents
-
observé PROJECT_TEST Lacune de preuve ×19 v1.1.0 → v1.2.1 runtime=go@1.26Qualité de preuve: legacy-evidence-incomplete · Variantes d’environnement: 2 · Premier relevé: 2026-08-17 · Dernière observation: 2026-08-20Candidat à une revérification diagnostique
-
observé PROJECT_COMPILE exit 1 ×1 v1.1.0 os=linux · runtime=go@1.26 sha256:089d53aa715f…<path> undefined: sdkmetric.WithAttributesgo/compiler · compiler-diagnostic · outer go testQualité de preuve: complete · Variantes d’environnement: 1 · Premier relevé: 2026-08-31 · Dernière observation: 2026-08-31
-
observé PROJECT_TEST exit 1 ×1 v1.1.0 os=linux · runtime=go@1.26 sha256:68a7069b7aae…--- FAIL: TestOTLPMetricHTTPExporterContract (0.00s) · === RUN TestWithTemporalitySelectorOption · --- PASS: TestWithTemporalitySelectorOption (0.00s) …go/test · test-runner-diagnostic · outer go testQualité de preuve: complete · Variantes d’environnement: 1 · Premier relevé: 2026-08-31 · Dernière observation: 2026-08-31
-
observé PROJECT_TEST exit 1 ×1 v1.1.0 os=linux · runtime=go@1.26 sha256:da67984267a5…--- FAIL: TestOTLPMetricHTTPExporter (0.00s) · FAIL test_otel 0.134sgo/test · test-runner-diagnostic · outer go testQualité de preuve: complete · Variantes d’environnement: 1 · Premier relevé: 2026-08-31 · Dernière observation: 2026-08-31
-
observé UNKNOWN exit 1 Lacune de preuve ×1 v1.1.0 os=linux · runtime=go@1.26 sha256:2a77dcac8561…Contract test failed: expected error when ExportSpans is called on unstarted exporter, got nil · exit status 1go · unclassified-diagnostic · outer go run · gap stage-unknownQualité de preuve: complete · Variantes d’environnement: 1 · Premier relevé: 2026-09-01 · Dernière observation: 2026-09-01Candidat à une revérification diagnostique
-
observé PROJECT_COMPILE exit 1 ×1 v1.1.0 os=linux · runtime=go@1.26 sha256:e84876b56a4e…test/contract.go:<n>:<n>: assignment mismatch: 1 variable but otlptrace.New returns 2 values …go/compiler · compiler-diagnostic · outer go runQualité de preuve: complete · Variantes d’environnement: 1 · Premier relevé: 2026-09-02 · Dernière observation: 2026-09-02
-
observé PROJECT_TEST exit 1 ×1 v1.1.0 os=linux · runtime=go@1.26 sha256:4d9975558e16…--- FAIL: TestWithoutInsecureFailsPlaintext (10.00s) · FAIL example.com/otlptracegrpc-insecure/test 10.009sgo/test · test-runner-diagnostic · outer go testQualité de preuve: complete · Variantes d’environnement: 1 · Premier relevé: 2026-09-02 · Dernière observation: 2026-09-02
-
observé PROJECT_TEST exit 1 ×1 v1.1.0 os=linux · runtime=go@1.26 sha256:b6b84f5f81cf…--- FAIL: TestWithInsecureContract (10.00s) · contract_test.go:<n>: expected at least one gRPC trace export request, got none …go/test · test-runner-diagnostic · outer go testQualité de preuve: complete · Variantes d’environnement: 1 · Premier relevé: 2026-09-02 · Dernière observation: 2026-09-02