記録golanggo.opentelemetry.io/auto/sdkv1.1.0go.opentelemetry.io/auto/sdk.TracerProvider
条件を変更
現在の条件
go.opentelemetry.io/auto/sdk.TracerProvider @v1.1.0ubuntu glibc · x64 · go 1.26 · go 1
3 回中 3 回が成功
観測 — 実際のプロジェクトのビルドがこの座標から報告されました。
サンプルあり — この座標ではまだ実行していない (3)
- プロジェクト観測
- 3 / 3
- コントラクト検証
- この座標にはなし
- 独立した報告ピア
- 1
- 最終記録
- 2026-08-31
開ける証拠
依存関係のヘルス
このリリースの依存関係の組み合わせと失敗観測
| ライブラリ | バージョン | ヘルス | その座標で測定されたこと | プロジェクト |
|---|---|---|---|---|
| github.com/stretchr/testify | v1.10.0 | CANDIDATE 相関変更; 組み合わせ未証明 | ビルド観測済み | プロジェクト日 40 件 |
| github.com/stretchr/testify | v1.11.1 | CANDIDATE 相関変更; 組み合わせ未証明 | コントラクト合格 | プロジェクト日 6 件 |
| go.opentelemetry.io/otel | v1.34.0 | CANDIDATE 相関変更; 組み合わせ未証明 | コントラクト合格 | プロジェクト日 3 件 |
| go.opentelemetry.io/otel | v1.35.0 | CANDIDATE 相関変更; 組み合わせ未証明 | コントラクト合格 | プロジェクト日 7 件 |
| go.opentelemetry.io/otel | v1.37.0 | CANDIDATE 相関変更; 組み合わせ未証明 | コントラクト合格 | プロジェクト日 44 件 |
| go.opentelemetry.io/otel/trace | v1.34.0 | CANDIDATE 相関変更; 組み合わせ未証明 | ビルド観測済み | プロジェクト日 3 件 |
| go.opentelemetry.io/otel/trace | v1.35.0 | CANDIDATE 相関変更; 組み合わせ未証明 | コントラクト合格 | プロジェクト日 7 件 |
| go.opentelemetry.io/otel/trace | v1.37.0 | CANDIDATE 相関変更; 組み合わせ未証明 | コントラクト合格 | プロジェクト日 44 件 |
測定列は各依存関係自身のリリースに関するもので、2つのリリースの組み合わせに関するものではありません。リゾルバが2つを並べたという事実は、両者が協調して動く証拠ではありません。
リリースごとの依存バージョン
このパッケージの各リリースが子をどのバージョンに解決したかです。バージョンが動いた子が先に並びます — アップグレードが足元で何かを変えた地点です。
| ライブラリ | v1.2.1 | v1.1.0 |
|---|---|---|
| github.com/stretchr/testify | v1.12.1 | v1.11.1 |
| go.opentelemetry.io/otel | v1.44.0 | v1.34.0 |
| go.opentelemetry.io/otel/trace | v1.44.0 | v1.34.0 |
変動: 3 · 全リリースで同一: 0
エッジは、実機でリゾルバがあるリリースを別のリリースの隣に置いたという記録です。両者が一緒に動くという主張ではありません。その問いに答えるのは、ここに行があることではなくサンプルと契約です。
最近の失敗クラスター
-
観測済み PROJECT_TEST 証拠の欠落 ×19 v1.1.0 → v1.2.1 runtime=go@1.26証拠品質: legacy-evidence-incomplete · 環境バリアント: 2 · 初回記録: 2026-08-17 · 最終観測: 2026-08-20診断再検証候補
-
観測済み PROJECT_COMPILE exit 1 ×1 v1.1.0 os=linux · runtime=go@1.26 sha256:089d53aa715f…<path> undefined: sdkmetric.WithAttributesgo/compiler · compiler-diagnostic · outer go test証拠品質: complete · 環境バリアント: 1 · 初回記録: 2026-08-31 · 最終観測: 2026-08-31
-
観測済み PROJECT_TEST exit 1 ×1 v1.1.0 os=linux · runtime=go@1.26 sha256:68a7069b7aae…--- FAIL: TestOTLPMetricHTTPExporterContract (0.00s) · === RUN TestWithTemporalitySelectorOption · --- PASS: TestWithTemporalitySelectorOption (0.00s) …go/test · test-runner-diagnostic · outer go test証拠品質: complete · 環境バリアント: 1 · 初回記録: 2026-08-31 · 最終観測: 2026-08-31
-
観測済み PROJECT_TEST exit 1 ×1 v1.1.0 os=linux · runtime=go@1.26 sha256:da67984267a5…--- FAIL: TestOTLPMetricHTTPExporter (0.00s) · FAIL test_otel 0.134sgo/test · test-runner-diagnostic · outer go test証拠品質: complete · 環境バリアント: 1 · 初回記録: 2026-08-31 · 最終観測: 2026-08-31
-
観測済み UNKNOWN exit 1 証拠の欠落 ×1 v1.1.0 os=linux · runtime=go@1.26 sha256:2a77dcac8561…Contract test failed: expected error when ExportSpans is called on unstarted exporter, got nil · exit status 1go · unclassified-diagnostic · outer go run · gap stage-unknown証拠品質: complete · 環境バリアント: 1 · 初回記録: 2026-09-01 · 最終観測: 2026-09-01診断再検証候補
-
観測済み PROJECT_COMPILE exit 1 ×1 v1.1.0 os=linux · runtime=go@1.26 sha256:e84876b56a4e…test/contract.go:<n>:<n>: assignment mismatch: 1 variable but otlptrace.New returns 2 values …go/compiler · compiler-diagnostic · outer go run証拠品質: complete · 環境バリアント: 1 · 初回記録: 2026-09-02 · 最終観測: 2026-09-02
-
観測済み PROJECT_TEST exit 1 ×1 v1.1.0 os=linux · runtime=go@1.26 sha256:4d9975558e16…--- FAIL: TestWithoutInsecureFailsPlaintext (10.00s) · FAIL example.com/otlptracegrpc-insecure/test 10.009sgo/test · test-runner-diagnostic · outer go test証拠品質: complete · 環境バリアント: 1 · 初回記録: 2026-09-02 · 最終観測: 2026-09-02
-
観測済み PROJECT_TEST exit 1 ×1 v1.1.0 os=linux · runtime=go@1.26 sha256:b6b84f5f81cf…--- FAIL: TestWithInsecureContract (10.00s) · contract_test.go:<n>: expected at least one gRPC trace export request, got none …go/test · test-runner-diagnostic · outer go test証拠品質: complete · 環境バリアント: 1 · 初回記録: 2026-09-02 · 最終観測: 2026-09-02