Recordsgolanggo.opentelemetry.io/auto/sdkv1.1.0TracerProvider
Change the conditions
Current conditions
TracerProvider @v1.1.0ubuntu glibc · x64 · go 1.26 · go 1
3 of 3 passed
Observed — real project builds reported from this coordinate.
there is a sample here, and nothing of ours has run it at this coordinate yet (3)
- Project observations
- 3 / 3
- Contract verifications
- nothing at this coordinate
- Independent reporting peers
- 1
- Last recorded
- 2026-08-31
Dependency Health
Observed combinations and failure evidence for this release
First observed break
v1.1.0
go@1.26
19 FAIL · stage: PROJECT_TEST
| Library | Version | Health | Measured there | Projects |
|---|---|---|---|---|
| github.com/stretchr/testify | v1.10.0 | CANDIDATE Correlated change; unproven combination | builds observed | 40 project-days |
| github.com/stretchr/testify | v1.11.1 | CANDIDATE Correlated change; unproven combination | contract passed | 6 project-days |
| go.opentelemetry.io/otel | v1.34.0 | CANDIDATE Correlated change; unproven combination | contract passed | 3 project-days |
| go.opentelemetry.io/otel | v1.35.0 | CANDIDATE Correlated change; unproven combination | contract passed | 7 project-days |
| go.opentelemetry.io/otel | v1.37.0 | CANDIDATE Correlated change; unproven combination | contract passed | 44 project-days |
| go.opentelemetry.io/otel/trace | v1.34.0 | CANDIDATE Correlated change; unproven combination | builds observed | 3 project-days |
| go.opentelemetry.io/otel/trace | v1.35.0 | CANDIDATE Correlated change; unproven combination | contract passed | 7 project-days |
| go.opentelemetry.io/otel/trace | v1.37.0 | CANDIDATE Correlated change; unproven combination | contract passed | 44 project-days |
The measured column is about each dependency's own release, not about the pair. A resolver placing two releases side by side is not evidence that they work together.
Dependency versions across releases
What each release of this package resolved its children to. A child whose version moved is listed first: that is where an upgrade changed something underneath you.
| Library | v1.2.1 | v1.1.0 |
|---|---|---|
| github.com/stretchr/testify | v1.12.1 | v1.11.1 |
| go.opentelemetry.io/otel | v1.44.0 | v1.34.0 |
| go.opentelemetry.io/otel/trace | v1.44.0 | v1.34.0 |
Moved: 3 · unchanged at every release: 0
An edge records that a resolver placed one release beside another on a real machine. It is not a claim that the two work together; that question is answered by samples and contracts, not by presence here.
Recent failure clusters
-
observed PROJECT_TEST Evidence gap ×19 v1.1.0 → v1.2.1 runtime=go@1.26Evidence quality: legacy-evidence-incomplete · Environment variants: 2 · First recorded: 2026-08-17 · Last seen: 2026-08-20Diagnostic re-verification candidate
-
observed PROJECT_COMPILE exit 1 ×1 v1.1.0 os=linux · runtime=go@1.26 sha256:089d53aa715f…<path> undefined: sdkmetric.WithAttributesgo/compiler · compiler-diagnostic · outer go testEvidence quality: complete · Environment variants: 1 · First recorded: 2026-08-31 · Last seen: 2026-08-31
-
observed PROJECT_TEST exit 1 ×1 v1.1.0 os=linux · runtime=go@1.26 sha256:68a7069b7aae…--- FAIL: TestOTLPMetricHTTPExporterContract (0.00s) · === RUN TestWithTemporalitySelectorOption · --- PASS: TestWithTemporalitySelectorOption (0.00s) …go/test · test-runner-diagnostic · outer go testEvidence quality: complete · Environment variants: 1 · First recorded: 2026-08-31 · Last seen: 2026-08-31
-
observed PROJECT_TEST exit 1 ×1 v1.1.0 os=linux · runtime=go@1.26 sha256:da67984267a5…--- FAIL: TestOTLPMetricHTTPExporter (0.00s) · FAIL test_otel 0.134sgo/test · test-runner-diagnostic · outer go testEvidence quality: complete · Environment variants: 1 · First recorded: 2026-08-31 · Last seen: 2026-08-31
-
observed UNKNOWN exit 1 Evidence gap ×1 v1.1.0 os=linux · runtime=go@1.26 sha256:2a77dcac8561…Contract test failed: expected error when ExportSpans is called on unstarted exporter, got nil · exit status 1go · unclassified-diagnostic · outer go run · gap stage-unknownEvidence quality: complete · Environment variants: 1 · First recorded: 2026-09-01 · Last seen: 2026-09-01Diagnostic re-verification candidate
-
observed PROJECT_COMPILE exit 1 ×1 v1.1.0 os=linux · runtime=go@1.26 sha256:e84876b56a4e…test/contract.go:<n>:<n>: assignment mismatch: 1 variable but otlptrace.New returns 2 values …go/compiler · compiler-diagnostic · outer go runEvidence quality: complete · Environment variants: 1 · First recorded: 2026-09-02 · Last seen: 2026-09-02
-
observed PROJECT_TEST exit 1 ×1 v1.1.0 os=linux · runtime=go@1.26 sha256:4d9975558e16…--- FAIL: TestWithoutInsecureFailsPlaintext (10.00s) · FAIL example.com/otlptracegrpc-insecure/test 10.009sgo/test · test-runner-diagnostic · outer go testEvidence quality: complete · Environment variants: 1 · First recorded: 2026-09-02 · Last seen: 2026-09-02
-
observed PROJECT_TEST exit 1 ×1 v1.1.0 os=linux · runtime=go@1.26 sha256:b6b84f5f81cf…--- FAIL: TestWithInsecureContract (10.00s) · contract_test.go:<n>: expected at least one gRPC trace export request, got none …go/test · test-runner-diagnostic · outer go testEvidence quality: complete · Environment variants: 1 · First recorded: 2026-09-02 · Last seen: 2026-09-02