Записиgolanggo.opentelemetry.io/auto/sdkv1.1.0
Изменить условия
Текущие условия
go.opentelemetry.io/auto/sdk @v1.1.0debian glibc · x64 · go 1.26 · go · go
итог по пакету, а не API
Зафиксировано только присутствие в проектах. В этой координате ничего не запускалось.
Наблюдение — реальные сборки проектов сообщили об этой координате.
образец есть — в этой координате мы его ещё не запускали (3)
- Наблюдения в проектах
- в этой координате ничего
- Проверки контрактом
- в этой координате ничего
- Записи об использовании
- 9
- Независимые сообщившие пиры
- 2
- Последняя запись
- 2026-09-17
Здоровье зависимостей
Наблюдаемые комбинации и свидетельства сбоев для этого выпуска
| Библиотека | Версия | Состояние | Измерено там | Проектов |
|---|---|---|---|---|
| github.com/stretchr/testify | v1.10.0 | CANDIDATE Коррелированное изменение; комбинация не подтверждена | сборки наблюдались | 40 проектных дней |
| github.com/stretchr/testify | v1.11.1 | CANDIDATE Коррелированное изменение; комбинация не подтверждена | контракт пройден | 6 проектных дней |
| go.opentelemetry.io/otel | v1.34.0 | CANDIDATE Коррелированное изменение; комбинация не подтверждена | контракт пройден | 3 проектных дня |
| go.opentelemetry.io/otel | v1.35.0 | CANDIDATE Коррелированное изменение; комбинация не подтверждена | контракт пройден | 7 проектных дней |
| go.opentelemetry.io/otel | v1.37.0 | CANDIDATE Коррелированное изменение; комбинация не подтверждена | контракт пройден | 44 проектных дня |
| go.opentelemetry.io/otel/trace | v1.34.0 | CANDIDATE Коррелированное изменение; комбинация не подтверждена | сборки наблюдались | 3 проектных дня |
| go.opentelemetry.io/otel/trace | v1.35.0 | CANDIDATE Коррелированное изменение; комбинация не подтверждена | контракт пройден | 7 проектных дней |
| go.opentelemetry.io/otel/trace | v1.37.0 | CANDIDATE Коррелированное изменение; комбинация не подтверждена | контракт пройден | 44 проектных дня |
Столбец измерения относится к релизу самой зависимости, а не к паре. То, что резолвер поставил два релиза рядом, не доказывает, что они работают вместе.
Версии зависимостей по выпускам
К чему каждый выпуск этого пакета разрешил своих потомков. Потомок, чья версия сдвинулась, идёт первым: там обновление изменило что-то под вами.
| Библиотека | v1.2.1 | v1.1.0 |
|---|---|---|
| github.com/stretchr/testify | v1.12.1 | v1.11.1 |
| go.opentelemetry.io/otel | v1.44.0 | v1.34.0 |
| go.opentelemetry.io/otel/trace | v1.44.0 | v1.34.0 |
Сдвинулось: 3 · одинаково во всех выпусках: 0
Ребро фиксирует, что резолвер поставил один релиз рядом с другим на реальной машине. Это не утверждение, что они работают вместе; на этот вопрос отвечают образцы и контракты, а не наличие строки.
Недавние кластеры сбоев
-
наблюдалось PROJECT_TEST Пробел в данных ×19 v1.1.0 → v1.2.1 runtime=go@1.26Качество данных: legacy-evidence-incomplete · Варианты среды: 2 · Первая запись: 2026-08-17 · Последнее наблюдение: 2026-08-20Кандидат на диагностическую перепроверку
-
наблюдалось PROJECT_COMPILE exit 1 ×1 v1.1.0 os=linux · runtime=go@1.26 sha256:089d53aa715f…<path> undefined: sdkmetric.WithAttributesgo/compiler · compiler-diagnostic · outer go testКачество данных: complete · Варианты среды: 1 · Первая запись: 2026-08-31 · Последнее наблюдение: 2026-08-31
-
наблюдалось PROJECT_TEST exit 1 ×1 v1.1.0 os=linux · runtime=go@1.26 sha256:68a7069b7aae…--- FAIL: TestOTLPMetricHTTPExporterContract (0.00s) · === RUN TestWithTemporalitySelectorOption · --- PASS: TestWithTemporalitySelectorOption (0.00s) …go/test · test-runner-diagnostic · outer go testКачество данных: complete · Варианты среды: 1 · Первая запись: 2026-08-31 · Последнее наблюдение: 2026-08-31
-
наблюдалось PROJECT_TEST exit 1 ×1 v1.1.0 os=linux · runtime=go@1.26 sha256:da67984267a5…--- FAIL: TestOTLPMetricHTTPExporter (0.00s) · FAIL test_otel 0.134sgo/test · test-runner-diagnostic · outer go testКачество данных: complete · Варианты среды: 1 · Первая запись: 2026-08-31 · Последнее наблюдение: 2026-08-31
-
наблюдалось UNKNOWN exit 1 Пробел в данных ×1 v1.1.0 os=linux · runtime=go@1.26 sha256:2a77dcac8561…Contract test failed: expected error when ExportSpans is called on unstarted exporter, got nil · exit status 1go · unclassified-diagnostic · outer go run · gap stage-unknownКачество данных: complete · Варианты среды: 1 · Первая запись: 2026-09-01 · Последнее наблюдение: 2026-09-01Кандидат на диагностическую перепроверку
-
наблюдалось PROJECT_COMPILE exit 1 ×1 v1.1.0 os=linux · runtime=go@1.26 sha256:e84876b56a4e…test/contract.go:<n>:<n>: assignment mismatch: 1 variable but otlptrace.New returns 2 values …go/compiler · compiler-diagnostic · outer go runКачество данных: complete · Варианты среды: 1 · Первая запись: 2026-09-02 · Последнее наблюдение: 2026-09-02
-
наблюдалось PROJECT_TEST exit 1 ×1 v1.1.0 os=linux · runtime=go@1.26 sha256:4d9975558e16…--- FAIL: TestWithoutInsecureFailsPlaintext (10.00s) · FAIL example.com/otlptracegrpc-insecure/test 10.009sgo/test · test-runner-diagnostic · outer go testКачество данных: complete · Варианты среды: 1 · Первая запись: 2026-09-02 · Последнее наблюдение: 2026-09-02
-
наблюдалось PROJECT_TEST exit 1 ×1 v1.1.0 os=linux · runtime=go@1.26 sha256:b6b84f5f81cf…--- FAIL: TestWithInsecureContract (10.00s) · contract_test.go:<n>: expected at least one gRPC trace export request, got none …go/test · test-runner-diagnostic · outer go testКачество данных: complete · Варианты среды: 1 · Первая запись: 2026-09-02 · Последнее наблюдение: 2026-09-02