Registrosgolanggo.opentelemetry.io/auto/sdkv1.1.0go.opentelemetry.io/auto/sdk.TracerProvider
Mudar as condições
Condições atuais
go.opentelemetry.io/auto/sdk.TracerProvider @v1.1.0ubuntu glibc · x64 · go 1.26 · go 1
3 de 3 passaram
Observado — builds reais de projetos reportaram desta coordenada.
há uma amostra aqui e ainda não a executamos nesta coordenada (3)
- Observações de projetos
- 3 / 3
- Verificações de contrato
- nada nesta coordenada
- Peers independentes que reportaram
- 1
- Último registro
- 2026-08-31
Saúde das dependências
Combinações observadas e evidências de falha para esta versão
Primeira quebra observada
v1.1.0
go@1.26
19 FAIL · stage: PROJECT_TEST
| Biblioteca | Versão | Saúde | Medido ali | Projetos |
|---|---|---|---|---|
| github.com/stretchr/testify | v1.10.0 | CANDIDATE Mudança correlacionada; combinação não comprovada | builds observados | 40 dias-projeto |
| github.com/stretchr/testify | v1.11.1 | CANDIDATE Mudança correlacionada; combinação não comprovada | contrato aprovado | 6 dias-projeto |
| go.opentelemetry.io/otel | v1.34.0 | CANDIDATE Mudança correlacionada; combinação não comprovada | contrato aprovado | 3 dias-projeto |
| go.opentelemetry.io/otel | v1.35.0 | CANDIDATE Mudança correlacionada; combinação não comprovada | contrato aprovado | 7 dias-projeto |
| go.opentelemetry.io/otel | v1.37.0 | CANDIDATE Mudança correlacionada; combinação não comprovada | contrato aprovado | 44 dias-projeto |
| go.opentelemetry.io/otel/trace | v1.34.0 | CANDIDATE Mudança correlacionada; combinação não comprovada | builds observados | 3 dias-projeto |
| go.opentelemetry.io/otel/trace | v1.35.0 | CANDIDATE Mudança correlacionada; combinação não comprovada | contrato aprovado | 7 dias-projeto |
| go.opentelemetry.io/otel/trace | v1.37.0 | CANDIDATE Mudança correlacionada; combinação não comprovada | contrato aprovado | 44 dias-projeto |
A coluna de medição é sobre a versão de cada dependência em si, não sobre o par. Um resolvedor ter colocado duas versões lado a lado não é prova de que funcionam juntas.
Versões de dependências por versão
Para que cada versão deste pacote resolveu seus filhos. O filho cuja versão se moveu vem primeiro: foi ali que uma atualização mudou algo sob os seus pés.
| Biblioteca | v1.2.1 | v1.1.0 |
|---|---|---|
| github.com/stretchr/testify | v1.12.1 | v1.11.1 |
| go.opentelemetry.io/otel | v1.44.0 | v1.34.0 |
| go.opentelemetry.io/otel/trace | v1.44.0 | v1.34.0 |
Moveram-se: 3 · iguais em todas as versões: 0
Uma aresta registra que um resolvedor colocou uma versão ao lado de outra em uma máquina real. Não é uma afirmação de que as duas funcionam juntas; essa pergunta é respondida por amostras e contratos, não pela presença de uma linha.
Clusters de falha recentes
-
observado PROJECT_TEST Lacuna de evidência ×19 v1.1.0 → v1.2.1 runtime=go@1.26Qualidade da evidência: legacy-evidence-incomplete · Variantes de ambiente: 2 · Primeiro registro: 2026-08-17 · Visto por último: 2026-08-20Candidato a reverificação diagnóstica
-
observado PROJECT_COMPILE exit 1 ×1 v1.1.0 os=linux · runtime=go@1.26 sha256:089d53aa715f…<path> undefined: sdkmetric.WithAttributesgo/compiler · compiler-diagnostic · outer go testQualidade da evidência: complete · Variantes de ambiente: 1 · Primeiro registro: 2026-08-31 · Visto por último: 2026-08-31
-
observado PROJECT_TEST exit 1 ×1 v1.1.0 os=linux · runtime=go@1.26 sha256:68a7069b7aae…--- FAIL: TestOTLPMetricHTTPExporterContract (0.00s) · === RUN TestWithTemporalitySelectorOption · --- PASS: TestWithTemporalitySelectorOption (0.00s) …go/test · test-runner-diagnostic · outer go testQualidade da evidência: complete · Variantes de ambiente: 1 · Primeiro registro: 2026-08-31 · Visto por último: 2026-08-31
-
observado PROJECT_TEST exit 1 ×1 v1.1.0 os=linux · runtime=go@1.26 sha256:da67984267a5…--- FAIL: TestOTLPMetricHTTPExporter (0.00s) · FAIL test_otel 0.134sgo/test · test-runner-diagnostic · outer go testQualidade da evidência: complete · Variantes de ambiente: 1 · Primeiro registro: 2026-08-31 · Visto por último: 2026-08-31
-
observado UNKNOWN exit 1 Lacuna de evidência ×1 v1.1.0 os=linux · runtime=go@1.26 sha256:2a77dcac8561…Contract test failed: expected error when ExportSpans is called on unstarted exporter, got nil · exit status 1go · unclassified-diagnostic · outer go run · gap stage-unknownQualidade da evidência: complete · Variantes de ambiente: 1 · Primeiro registro: 2026-09-01 · Visto por último: 2026-09-01Candidato a reverificação diagnóstica
-
observado PROJECT_COMPILE exit 1 ×1 v1.1.0 os=linux · runtime=go@1.26 sha256:e84876b56a4e…test/contract.go:<n>:<n>: assignment mismatch: 1 variable but otlptrace.New returns 2 values …go/compiler · compiler-diagnostic · outer go runQualidade da evidência: complete · Variantes de ambiente: 1 · Primeiro registro: 2026-09-02 · Visto por último: 2026-09-02
-
observado PROJECT_TEST exit 1 ×1 v1.1.0 os=linux · runtime=go@1.26 sha256:4d9975558e16…--- FAIL: TestWithoutInsecureFailsPlaintext (10.00s) · FAIL example.com/otlptracegrpc-insecure/test 10.009sgo/test · test-runner-diagnostic · outer go testQualidade da evidência: complete · Variantes de ambiente: 1 · Primeiro registro: 2026-09-02 · Visto por último: 2026-09-02
-
observado PROJECT_TEST exit 1 ×1 v1.1.0 os=linux · runtime=go@1.26 sha256:b6b84f5f81cf…--- FAIL: TestWithInsecureContract (10.00s) · contract_test.go:<n>: expected at least one gRPC trace export request, got none …go/test · test-runner-diagnostic · outer go testQualidade da evidência: complete · Variantes de ambiente: 1 · Primeiro registro: 2026-09-02 · Visto por último: 2026-09-02