Записиgolanggo.opentelemetry.io/auto/sdkv1.1.0go.opentelemetry.io/auto/sdk.TracerProvider
OS × среда выполнения одним взглядом
Как читать ячейку: Число — это записанные наблюдения, на которые делится доля: одна сборка оставляет по наблюдению на каждый достигнутый этап, поэтому это не число сборок, не число машин и не число людей. Документ рядом — другой факт из другого источника: есть ли в этой координате образец и чем закончился наш запуск его там.
- в этой координате образца пока нет
- образец есть — в этой координате мы его ещё не запускали
- образец есть — наш запуск в этой координате завершился чисто
- образец есть — наш запуск в этой координате не прошёл
- образец есть — в этой координате записаны и успешный, и неуспешный запуск
- ничего не записано — неизвестно, а не «работает» и не «сломано»
- под этой ячейкой есть уровень — нажмите, чтобы открыть
Документ означает, что в этой координате есть образец. Его НАЛИЧИЕ — это факт об этой версии и этом API, оно не меняется от ОС, среды выполнения или пакетного менеджера; ЦВЕТ говорит, как этот образец отработал в том окружении, которое вы сейчас смотрите.
Опубликованные примеры
- go.opentelemetry.io/auto/sdk v1.1.0: TracerProvider Эта сеть предлагает одно: образец, который собирается. Она запустила его в песочнице и сохранила подписанную квитанцию. Она ничего не оценивает и ничего не гарантирует — собирается ли тот же код у вас, она не измеряла. HOWTracerProvidergo 1.26.6 MIT-0 · 2026-08-24
- go.opentelemetry.io/auto/sdk v1.1.0: TracerProvider Эта сеть предлагает одно: образец, который собирается. Она запустила его в песочнице и сохранила подписанную квитанцию. Она ничего не оценивает и ничего не гарантирует — собирается ли тот же код у вас, она не измеряла. HOWTracerProvidergo 1.26.6 MIT-0 · 2026-08-19
- go.opentelemetry.io/auto/sdk v1.1.0: TracerProvider Эта сеть предлагает одно: образец, который собирается. Она запустила его в песочнице и сохранила подписанную квитанцию. Она ничего не оценивает и ничего не гарантирует — собирается ли тот же код у вас, она не измеряла. HOWgo.opentelemetry.io/auto/sdk.TracerProvider MIT-0 · 2026-08-27
Матрица совместимости
Наблюдения уровня проекта и проверки символов/контрактов считаются раздельно и никогда не суммируются.
Эти числа не различают, как именно был вызван символ: перегрузки, наборы аргументов и опции считаются вместе. Что делает конкретная форма вызова, доказывает контракт образца, а не эти цифры.
| Окружение | Достоверность | Наблюдения | Проверено | Доля успешных | Пиры | Последнее наблюдение |
|---|---|---|---|---|---|---|
| go 1.26 · Go · go · linux glibc
Наблюдения: PROJECT_PROCESS 2✓ · PROJECT_TEST 1✓
|
LOW | 3 | 0 | 100 % | 1 | 2026-08-31 |
| go 1.26 · Go · go · linux musl · docker
Проверено: CONTRACT 1✓
|
LOW | 0 | 1 | 100 % | 0 · 1✓ | 2026-08-27 |
snapshot · 2026-09-15
Кластеры сбоев
-
наблюдалось PROJECT_TEST Пробел в данных ×19 v1.1.0 → v1.2.1 runtime=go@1.26Качество данных: legacy-evidence-incomplete · Варианты среды: 2 · Первая запись: 2026-08-17 · Последнее наблюдение: 2026-08-20Кандидат на диагностическую перепроверку
-
наблюдалось PROJECT_COMPILE exit 1 ×1 v1.1.0 os=linux · runtime=go@1.26 sha256:089d53aa715f…<path> undefined: sdkmetric.WithAttributesgo/compiler · compiler-diagnostic · outer go testКачество данных: complete · Варианты среды: 1 · Первая запись: 2026-08-31 · Последнее наблюдение: 2026-08-31
-
наблюдалось PROJECT_TEST exit 1 ×1 v1.1.0 os=linux · runtime=go@1.26 sha256:68a7069b7aae…--- FAIL: TestOTLPMetricHTTPExporterContract (0.00s) · === RUN TestWithTemporalitySelectorOption · --- PASS: TestWithTemporalitySelectorOption (0.00s) …go/test · test-runner-diagnostic · outer go testКачество данных: complete · Варианты среды: 1 · Первая запись: 2026-08-31 · Последнее наблюдение: 2026-08-31
-
наблюдалось PROJECT_TEST exit 1 ×1 v1.1.0 os=linux · runtime=go@1.26 sha256:da67984267a5…--- FAIL: TestOTLPMetricHTTPExporter (0.00s) · FAIL test_otel 0.134sgo/test · test-runner-diagnostic · outer go testКачество данных: complete · Варианты среды: 1 · Первая запись: 2026-08-31 · Последнее наблюдение: 2026-08-31
-
наблюдалось UNKNOWN exit 1 Пробел в данных ×1 v1.1.0 os=linux · runtime=go@1.26 sha256:2a77dcac8561…Contract test failed: expected error when ExportSpans is called on unstarted exporter, got nil · exit status 1go · unclassified-diagnostic · outer go run · gap stage-unknownКачество данных: complete · Варианты среды: 1 · Первая запись: 2026-09-01 · Последнее наблюдение: 2026-09-01Кандидат на диагностическую перепроверку
-
наблюдалось PROJECT_COMPILE exit 1 ×1 v1.1.0 os=linux · runtime=go@1.26 sha256:e84876b56a4e…test/contract.go:<n>:<n>: assignment mismatch: 1 variable but otlptrace.New returns 2 values …go/compiler · compiler-diagnostic · outer go runКачество данных: complete · Варианты среды: 1 · Первая запись: 2026-09-02 · Последнее наблюдение: 2026-09-02
-
наблюдалось PROJECT_TEST exit 1 ×1 v1.1.0 os=linux · runtime=go@1.26 sha256:4d9975558e16…--- FAIL: TestWithoutInsecureFailsPlaintext (10.00s) · FAIL example.com/otlptracegrpc-insecure/test 10.009sgo/test · test-runner-diagnostic · outer go testКачество данных: complete · Варианты среды: 1 · Первая запись: 2026-09-02 · Последнее наблюдение: 2026-09-02
-
наблюдалось PROJECT_TEST exit 1 ×1 v1.1.0 os=linux · runtime=go@1.26 sha256:b6b84f5f81cf…--- FAIL: TestWithInsecureContract (10.00s) · contract_test.go:<n>: expected at least one gRPC trace export request, got none …go/test · test-runner-diagnostic · outer go testКачество данных: complete · Варианты среды: 1 · Первая запись: 2026-09-02 · Последнее наблюдение: 2026-09-02