Записиgolanggithub.com/russross/blackfriday/v2v2.1.0github.com/russross/blackfriday/v2.CodeBlock
Изменить условия
Текущие условия
github.com/russross/blackfriday/v2.CodeBlock @v2.1.0ubuntu glibc · x64 · go 1.26 · go 1
0 из 6 прошли
Проверено — эта сеть выполнила контракт в этой координате.
образец есть — наш запуск в этой координате не прошёл
- Наблюдения в проектах
- 3 / 3
- Проверки контрактом
- 0 / 6
- Независимые сообщившие пиры
- 2
- Последняя запись
- 2026-08-31
Свидетельства, которые можно открыть
Здоровье зависимостей
Разрешение прочитало дерево этого релиза и не нашло зависимостей. Это измерение, а не его отсутствие.
Недавние кластеры сбоев
-
наблюдалось PROJECT_PROCESS Пробел в данных ×3 v2.1.0 os=linux · runtime=go@1.26Качество данных: legacy-evidence-incomplete · Варианты среды: 1 · Первая запись: 2026-08-21 · Последнее наблюдение: 2026-08-26Кандидат на диагностическую перепроверку
-
наблюдалось PROJECT_TEST Пробел в данных ×2 v2.1.0 os=linux · runtime=go@1.26Качество данных: legacy-evidence-incomplete · Варианты среды: 1 · Первая запись: 2026-08-26 · Последнее наблюдение: 2026-08-26Кандидат на диагностическую перепроверку
-
наблюдалось UNKNOWN exit 1 Пробел в данных ×1 v2.1.0 os=linux · runtime=go@1.26 sha256:f3a5a3011077…panic: interface conversion: interface {} is nil, not *caddy.Replacer · goroutine 1 [running]: …go · unclassified-diagnostic · outer go run · gap stage-unknownКачество данных: complete · Варианты среды: 1 · Первая запись: 2026-08-27 · Последнее наблюдение: 2026-08-27Кандидат на диагностическую перепроверку
-
наблюдалось PROJECT_TEST exit 1 ×1 v2.1.0 os=linux · runtime=go@1.26 sha256:dda800f87ad3…--- FAIL: TestPathAndMethodMatchers (0.00s) · panic: interface conversion: interface {} is nil, not *caddy.Replacer [recovered, repanicked] …go/test · test-runner-diagnostic · outer go testКачество данных: complete · Варианты среды: 1 · Первая запись: 2026-08-29 · Последнее наблюдение: 2026-08-29
-
наблюдалось PROJECT_COMPILE exit 1 ×1 v2.1.0 os=linux · runtime=go@1.26 sha256:9b72acad915d…test/contract.go:<n>:<n>: cannot use func(dest string) (destUrl string, title string, matched bool) {…} (value of type func(dest string) (destUrl string, …go/compiler · compiler-diagnostic · outer go runКачество данных: complete · Варианты среды: 1 · Первая запись: 2026-08-31 · Последнее наблюдение: 2026-08-31
-
наблюдалось PROJECT_TEST exit 1 ×1 v2.1.0 os=linux · runtime=go@1.26 sha256:a45d405e2dee…--- FAIL: TestHeadingNodeParsingATX (0.00s) · panic: runtime error: invalid memory address or nil pointer dereference [recovered, repanicked] …go/test · test-runner-diagnostic · outer go testКачество данных: complete · Варианты среды: 1 · Первая запись: 2026-08-31 · Последнее наблюдение: 2026-08-31
-
наблюдалось PROJECT_TEST exit 1 ×1 v2.1.0 os=linux · runtime=go@1.26 sha256:f0a768eeb13d…--- FAIL: TestCommonHTMLFlagsRenderingBehavior (0.00s) · FAIL example.com/blackfridayflags 0.003sgo/test · test-runner-diagnostic · outer go testКачество данных: complete · Варианты среды: 1 · Первая запись: 2026-08-31 · Последнее наблюдение: 2026-08-31
-
наблюдалось UNKNOWN exit 1 Пробел в данных ×1 v2.1.0 os=linux · runtime=go@1.26 github.com/russross/blackfriday/v2.CodeBlock sha256:0077aae44190…Assertion 2 failed: expected custom heading id prefix <str>, got <str><url><str>_blank\<str> · exit status 1go · unclassified-diagnostic · outer go run · gap stage-unknownКачество данных: complete · Варианты среды: 1 · Первая запись: 2026-08-31 · Последнее наблюдение: 2026-08-31Кандидат на диагностическую перепроверку
-
наблюдалось UNKNOWN exit 2 Пробел в данных ×1 v2.1.0 os=linux · runtime=go@1.26 sha256:00e630595b1e…flag provided but not defined: -e · usage: go run [build flags] [-exec xprog] package [arguments...] · Run <str> for details.go · unclassified-diagnostic · outer go run · gap stage-unknownКачество данных: complete · Варианты среды: 1 · Первая запись: 2026-08-31 · Последнее наблюдение: 2026-08-31Кандидат на диагностическую перепроверку
-
наблюдалось UNKNOWN exit 1 Пробел в данных ×1 v2.1.0 os=linux · runtime=go@1.26 github.com/russross/blackfriday/v2.CodeBlock sha256:0fe9af72c24d…Contract verification failed: expected <str>language-go\<str> in FencedCode backtick output, got: <pre><code class=<str>>fmt.Println("testing") …go · unclassified-diagnostic · outer go run · gap stage-unknownКачество данных: complete · Варианты среды: 1 · Первая запись: 2026-08-31 · Последнее наблюдение: 2026-08-31Кандидат на диагностическую перепроверку
-
наблюдалось UNKNOWN exit 1 Пробел в данных ×1 v2.1.0 os=linux · runtime=go@1.26 sha256:16f67eb44d58…Contract verification failed: expected empty Document to have nil FirstChild, got: Heading: <str> · exit status 1go · unclassified-diagnostic · outer go run · gap stage-unknownКачество данных: complete · Варианты среды: 1 · Первая запись: 2026-08-31 · Последнее наблюдение: 2026-08-31Кандидат на диагностическую перепроверку
-
наблюдалось UNKNOWN exit 1 Пробел в данных ×1 v2.1.0 os=linux · runtime=go@1.26 github.com/russross/blackfriday/v2.CodeBlock sha256:2d98da748a0c…Contract verification failed: expected raw fenced backticks in paragraph with WithNoExtensions, got: <p><code>go · fmt.Println("testing") …go · unclassified-diagnostic · outer go run · gap stage-unknownКачество данных: complete · Варианты среды: 1 · Первая запись: 2026-08-31 · Последнее наблюдение: 2026-08-31Кандидат на диагностическую перепроверку
Показаны 12 наиболее часто сообщаемых из 23 записанных кластеров отказов. Остальные — единичные сообщения.