Relevésgolanggithub.com/russross/blackfriday/v2v2.1.0github.com/russross/blackfriday/v2.CodeBlock
Changer les conditions
Conditions actuelles
github.com/russross/blackfriday/v2.CodeBlock @v2.1.0ubuntu glibc · x64 · go 1.26 · go 1
0 sur 6 ont réussi
Vérifié — ce réseau a exécuté un contrat à cette coordonnée.
il y a un échantillon ici et notre exécution à cette coordonnée a échoué
- Observations de projets
- 3 / 3
- Vérifications de contrat
- 0 / 6
- Pairs rapporteurs indépendants
- 2
- Dernier enregistrement
- 2026-08-31
Preuves que vous pouvez ouvrir
Santé des dépendances
Une résolution a lu l'arbre de cette version et n'a trouvé aucune dépendance. C'est une mesure, pas une mesure manquante.
Clusters d'échecs récents
-
observé PROJECT_PROCESS Lacune de preuve ×3 v2.1.0 os=linux · runtime=go@1.26Qualité de preuve: legacy-evidence-incomplete · Variantes d’environnement: 1 · Premier relevé: 2026-08-21 · Dernière observation: 2026-08-26Candidat à une revérification diagnostique
-
observé PROJECT_TEST Lacune de preuve ×2 v2.1.0 os=linux · runtime=go@1.26Qualité de preuve: legacy-evidence-incomplete · Variantes d’environnement: 1 · Premier relevé: 2026-08-26 · Dernière observation: 2026-08-26Candidat à une revérification diagnostique
-
observé UNKNOWN exit 1 Lacune de preuve ×1 v2.1.0 os=linux · runtime=go@1.26 sha256:f3a5a3011077…panic: interface conversion: interface {} is nil, not *caddy.Replacer · goroutine 1 [running]: …go · unclassified-diagnostic · outer go run · gap stage-unknownQualité de preuve: complete · Variantes d’environnement: 1 · Premier relevé: 2026-08-27 · Dernière observation: 2026-08-27Candidat à une revérification diagnostique
-
observé PROJECT_TEST exit 1 ×1 v2.1.0 os=linux · runtime=go@1.26 sha256:dda800f87ad3…--- FAIL: TestPathAndMethodMatchers (0.00s) · panic: interface conversion: interface {} is nil, not *caddy.Replacer [recovered, repanicked] …go/test · test-runner-diagnostic · outer go testQualité de preuve: complete · Variantes d’environnement: 1 · Premier relevé: 2026-08-29 · Dernière observation: 2026-08-29
-
observé PROJECT_COMPILE exit 1 ×1 v2.1.0 os=linux · runtime=go@1.26 sha256:9b72acad915d…test/contract.go:<n>:<n>: cannot use func(dest string) (destUrl string, title string, matched bool) {…} (value of type func(dest string) (destUrl string, …go/compiler · compiler-diagnostic · outer go runQualité de preuve: complete · Variantes d’environnement: 1 · Premier relevé: 2026-08-31 · Dernière observation: 2026-08-31
-
observé PROJECT_TEST exit 1 ×1 v2.1.0 os=linux · runtime=go@1.26 sha256:a45d405e2dee…--- FAIL: TestHeadingNodeParsingATX (0.00s) · panic: runtime error: invalid memory address or nil pointer dereference [recovered, repanicked] …go/test · test-runner-diagnostic · outer go testQualité de preuve: complete · Variantes d’environnement: 1 · Premier relevé: 2026-08-31 · Dernière observation: 2026-08-31
-
observé PROJECT_TEST exit 1 ×1 v2.1.0 os=linux · runtime=go@1.26 sha256:f0a768eeb13d…--- FAIL: TestCommonHTMLFlagsRenderingBehavior (0.00s) · FAIL example.com/blackfridayflags 0.003sgo/test · test-runner-diagnostic · outer go testQualité de preuve: complete · Variantes d’environnement: 1 · Premier relevé: 2026-08-31 · Dernière observation: 2026-08-31
-
observé UNKNOWN exit 1 Lacune de preuve ×1 v2.1.0 os=linux · runtime=go@1.26 github.com/russross/blackfriday/v2.CodeBlock sha256:0077aae44190…Assertion 2 failed: expected custom heading id prefix <str>, got <str><url><str>_blank\<str> · exit status 1go · unclassified-diagnostic · outer go run · gap stage-unknownQualité de preuve: complete · Variantes d’environnement: 1 · Premier relevé: 2026-08-31 · Dernière observation: 2026-08-31Candidat à une revérification diagnostique
-
observé UNKNOWN exit 2 Lacune de preuve ×1 v2.1.0 os=linux · runtime=go@1.26 sha256:00e630595b1e…flag provided but not defined: -e · usage: go run [build flags] [-exec xprog] package [arguments...] · Run <str> for details.go · unclassified-diagnostic · outer go run · gap stage-unknownQualité de preuve: complete · Variantes d’environnement: 1 · Premier relevé: 2026-08-31 · Dernière observation: 2026-08-31Candidat à une revérification diagnostique
-
observé UNKNOWN exit 1 Lacune de preuve ×1 v2.1.0 os=linux · runtime=go@1.26 github.com/russross/blackfriday/v2.CodeBlock sha256:0fe9af72c24d…Contract verification failed: expected <str>language-go\<str> in FencedCode backtick output, got: <pre><code class=<str>>fmt.Println("testing") …go · unclassified-diagnostic · outer go run · gap stage-unknownQualité de preuve: complete · Variantes d’environnement: 1 · Premier relevé: 2026-08-31 · Dernière observation: 2026-08-31Candidat à une revérification diagnostique
-
observé UNKNOWN exit 1 Lacune de preuve ×1 v2.1.0 os=linux · runtime=go@1.26 sha256:16f67eb44d58…Contract verification failed: expected empty Document to have nil FirstChild, got: Heading: <str> · exit status 1go · unclassified-diagnostic · outer go run · gap stage-unknownQualité de preuve: complete · Variantes d’environnement: 1 · Premier relevé: 2026-08-31 · Dernière observation: 2026-08-31Candidat à une revérification diagnostique
-
observé UNKNOWN exit 1 Lacune de preuve ×1 v2.1.0 os=linux · runtime=go@1.26 github.com/russross/blackfriday/v2.CodeBlock sha256:2d98da748a0c…Contract verification failed: expected raw fenced backticks in paragraph with WithNoExtensions, got: <p><code>go · fmt.Println("testing") …go · unclassified-diagnostic · outer go run · gap stage-unknownQualité de preuve: complete · Variantes d’environnement: 1 · Premier relevé: 2026-08-31 · Dernière observation: 2026-08-31Candidat à une revérification diagnostique
Affichage des 12 plus signalés parmi 23 groupes d’échecs enregistrés. Le reste sont des signalements uniques.