Registrosgolanggithub.com/russross/blackfriday/v2v2.1.0github.com/russross/blackfriday/v2.CodeBlock
Cambiar las condiciones
Condiciones actuales
github.com/russross/blackfriday/v2.CodeBlock @v2.1.0ubuntu glibc · x64 · go 1.26 · go 1
0 de 6 pasaron
Verificado: esta red ejecutó un contrato en esta coordenada.
hay una muestra aquí y nuestra ejecución en esta coordenada falló
- Observaciones de proyectos
- 3 / 3
- Verificaciones de contrato
- 0 / 6
- Peers independientes que reportaron
- 2
- Último registro
- 2026-08-31
Evidencia que puedes abrir
Salud de dependencias
Una resolución leyó el árbol de esta versión y no encontró dependencias. Es una medición, no una que falte.
Clústeres de fallos recientes
-
observado PROJECT_PROCESS Brecha de evidencia ×3 v2.1.0 os=linux · runtime=go@1.26Calidad de evidencia: legacy-evidence-incomplete · Variantes de entorno: 1 · Primer registro: 2026-08-21 · Última observación: 2026-08-26Candidato a reverificación diagnóstica
-
observado PROJECT_TEST Brecha de evidencia ×2 v2.1.0 os=linux · runtime=go@1.26Calidad de evidencia: legacy-evidence-incomplete · Variantes de entorno: 1 · Primer registro: 2026-08-26 · Última observación: 2026-08-26Candidato a reverificación diagnóstica
-
observado UNKNOWN exit 1 Brecha de evidencia ×1 v2.1.0 os=linux · runtime=go@1.26 sha256:f3a5a3011077…panic: interface conversion: interface {} is nil, not *caddy.Replacer · goroutine 1 [running]: …go · unclassified-diagnostic · outer go run · gap stage-unknownCalidad de evidencia: complete · Variantes de entorno: 1 · Primer registro: 2026-08-27 · Última observación: 2026-08-27Candidato a reverificación diagnóstica
-
observado PROJECT_TEST exit 1 ×1 v2.1.0 os=linux · runtime=go@1.26 sha256:dda800f87ad3…--- FAIL: TestPathAndMethodMatchers (0.00s) · panic: interface conversion: interface {} is nil, not *caddy.Replacer [recovered, repanicked] …go/test · test-runner-diagnostic · outer go testCalidad de evidencia: complete · Variantes de entorno: 1 · Primer registro: 2026-08-29 · Última observación: 2026-08-29
-
observado PROJECT_COMPILE exit 1 ×1 v2.1.0 os=linux · runtime=go@1.26 sha256:9b72acad915d…test/contract.go:<n>:<n>: cannot use func(dest string) (destUrl string, title string, matched bool) {…} (value of type func(dest string) (destUrl string, …go/compiler · compiler-diagnostic · outer go runCalidad de evidencia: complete · Variantes de entorno: 1 · Primer registro: 2026-08-31 · Última observación: 2026-08-31
-
observado PROJECT_TEST exit 1 ×1 v2.1.0 os=linux · runtime=go@1.26 sha256:a45d405e2dee…--- FAIL: TestHeadingNodeParsingATX (0.00s) · panic: runtime error: invalid memory address or nil pointer dereference [recovered, repanicked] …go/test · test-runner-diagnostic · outer go testCalidad de evidencia: complete · Variantes de entorno: 1 · Primer registro: 2026-08-31 · Última observación: 2026-08-31
-
observado PROJECT_TEST exit 1 ×1 v2.1.0 os=linux · runtime=go@1.26 sha256:f0a768eeb13d…--- FAIL: TestCommonHTMLFlagsRenderingBehavior (0.00s) · FAIL example.com/blackfridayflags 0.003sgo/test · test-runner-diagnostic · outer go testCalidad de evidencia: complete · Variantes de entorno: 1 · Primer registro: 2026-08-31 · Última observación: 2026-08-31
-
observado UNKNOWN exit 1 Brecha de evidencia ×1 v2.1.0 os=linux · runtime=go@1.26 github.com/russross/blackfriday/v2.CodeBlock sha256:0077aae44190…Assertion 2 failed: expected custom heading id prefix <str>, got <str><url><str>_blank\<str> · exit status 1go · unclassified-diagnostic · outer go run · gap stage-unknownCalidad de evidencia: complete · Variantes de entorno: 1 · Primer registro: 2026-08-31 · Última observación: 2026-08-31Candidato a reverificación diagnóstica
-
observado UNKNOWN exit 2 Brecha de evidencia ×1 v2.1.0 os=linux · runtime=go@1.26 sha256:00e630595b1e…flag provided but not defined: -e · usage: go run [build flags] [-exec xprog] package [arguments...] · Run <str> for details.go · unclassified-diagnostic · outer go run · gap stage-unknownCalidad de evidencia: complete · Variantes de entorno: 1 · Primer registro: 2026-08-31 · Última observación: 2026-08-31Candidato a reverificación diagnóstica
-
observado UNKNOWN exit 1 Brecha de evidencia ×1 v2.1.0 os=linux · runtime=go@1.26 github.com/russross/blackfriday/v2.CodeBlock sha256:0fe9af72c24d…Contract verification failed: expected <str>language-go\<str> in FencedCode backtick output, got: <pre><code class=<str>>fmt.Println("testing") …go · unclassified-diagnostic · outer go run · gap stage-unknownCalidad de evidencia: complete · Variantes de entorno: 1 · Primer registro: 2026-08-31 · Última observación: 2026-08-31Candidato a reverificación diagnóstica
-
observado UNKNOWN exit 1 Brecha de evidencia ×1 v2.1.0 os=linux · runtime=go@1.26 sha256:16f67eb44d58…Contract verification failed: expected empty Document to have nil FirstChild, got: Heading: <str> · exit status 1go · unclassified-diagnostic · outer go run · gap stage-unknownCalidad de evidencia: complete · Variantes de entorno: 1 · Primer registro: 2026-08-31 · Última observación: 2026-08-31Candidato a reverificación diagnóstica
-
observado UNKNOWN exit 1 Brecha de evidencia ×1 v2.1.0 os=linux · runtime=go@1.26 github.com/russross/blackfriday/v2.CodeBlock sha256:2d98da748a0c…Contract verification failed: expected raw fenced backticks in paragraph with WithNoExtensions, got: <p><code>go · fmt.Println("testing") …go · unclassified-diagnostic · outer go run · gap stage-unknownCalidad de evidencia: complete · Variantes de entorno: 1 · Primer registro: 2026-08-31 · Última observación: 2026-08-31Candidato a reverificación diagnóstica
Se muestran los 12 más reportados de 23 grupos de fallos registrados. El resto son reportes únicos.