Aufzeichnungengolanggithub.com/russross/blackfriday/v2v2.1.0github.com/russross/blackfriday/v2.CodeBlock
Bedingungen ändern
Aktuelle Bedingungen
github.com/russross/blackfriday/v2.CodeBlock @v2.1.0ubuntu glibc · x64 · go 1.26 · go 1
0 von 6 bestanden
Verifiziert — dieses Netzwerk hat an dieser Koordinate einen Contract ausgeführt.
hier gibt es ein Sample, und unser Lauf an dieser Koordinate ist fehlgeschlagen
- Projektbeobachtungen
- 3 / 3
- Contract-Verifikationen
- 0 / 6
- Unabhängig meldende Peers
- 2
- Zuletzt erfasst
- 2026-08-31
Nachweise zum Öffnen
Abhängigkeits-Zustand
Eine Auflösung hat den Baum dieses Releases gelesen und keine Abhängigkeiten gefunden. Das ist eine Messung, keine fehlende.
Aktuelle Fehler-Cluster
-
beobachtet PROJECT_PROCESS Beweislücke ×3 v2.1.0 os=linux · runtime=go@1.26Beweisqualität: legacy-evidence-incomplete · Umgebungsvarianten: 1 · Zuerst erfasst: 2026-08-21 · Zuletzt gesehen: 2026-08-26Kandidat für diagnostische Neuprüfung
-
beobachtet PROJECT_TEST Beweislücke ×2 v2.1.0 os=linux · runtime=go@1.26Beweisqualität: legacy-evidence-incomplete · Umgebungsvarianten: 1 · Zuerst erfasst: 2026-08-26 · Zuletzt gesehen: 2026-08-26Kandidat für diagnostische Neuprüfung
-
beobachtet UNKNOWN exit 1 Beweislücke ×1 v2.1.0 os=linux · runtime=go@1.26 sha256:f3a5a3011077…panic: interface conversion: interface {} is nil, not *caddy.Replacer · goroutine 1 [running]: …go · unclassified-diagnostic · outer go run · gap stage-unknownBeweisqualität: complete · Umgebungsvarianten: 1 · Zuerst erfasst: 2026-08-27 · Zuletzt gesehen: 2026-08-27Kandidat für diagnostische Neuprüfung
-
beobachtet PROJECT_TEST exit 1 ×1 v2.1.0 os=linux · runtime=go@1.26 sha256:dda800f87ad3…--- FAIL: TestPathAndMethodMatchers (0.00s) · panic: interface conversion: interface {} is nil, not *caddy.Replacer [recovered, repanicked] …go/test · test-runner-diagnostic · outer go testBeweisqualität: complete · Umgebungsvarianten: 1 · Zuerst erfasst: 2026-08-29 · Zuletzt gesehen: 2026-08-29
-
beobachtet PROJECT_COMPILE exit 1 ×1 v2.1.0 os=linux · runtime=go@1.26 sha256:9b72acad915d…test/contract.go:<n>:<n>: cannot use func(dest string) (destUrl string, title string, matched bool) {…} (value of type func(dest string) (destUrl string, …go/compiler · compiler-diagnostic · outer go runBeweisqualität: complete · Umgebungsvarianten: 1 · Zuerst erfasst: 2026-08-31 · Zuletzt gesehen: 2026-08-31
-
beobachtet PROJECT_TEST exit 1 ×1 v2.1.0 os=linux · runtime=go@1.26 sha256:a45d405e2dee…--- FAIL: TestHeadingNodeParsingATX (0.00s) · panic: runtime error: invalid memory address or nil pointer dereference [recovered, repanicked] …go/test · test-runner-diagnostic · outer go testBeweisqualität: complete · Umgebungsvarianten: 1 · Zuerst erfasst: 2026-08-31 · Zuletzt gesehen: 2026-08-31
-
beobachtet PROJECT_TEST exit 1 ×1 v2.1.0 os=linux · runtime=go@1.26 sha256:f0a768eeb13d…--- FAIL: TestCommonHTMLFlagsRenderingBehavior (0.00s) · FAIL example.com/blackfridayflags 0.003sgo/test · test-runner-diagnostic · outer go testBeweisqualität: complete · Umgebungsvarianten: 1 · Zuerst erfasst: 2026-08-31 · Zuletzt gesehen: 2026-08-31
-
beobachtet UNKNOWN exit 1 Beweislücke ×1 v2.1.0 os=linux · runtime=go@1.26 github.com/russross/blackfriday/v2.CodeBlock sha256:0077aae44190…Assertion 2 failed: expected custom heading id prefix <str>, got <str><url><str>_blank\<str> · exit status 1go · unclassified-diagnostic · outer go run · gap stage-unknownBeweisqualität: complete · Umgebungsvarianten: 1 · Zuerst erfasst: 2026-08-31 · Zuletzt gesehen: 2026-08-31Kandidat für diagnostische Neuprüfung
-
beobachtet UNKNOWN exit 2 Beweislücke ×1 v2.1.0 os=linux · runtime=go@1.26 sha256:00e630595b1e…flag provided but not defined: -e · usage: go run [build flags] [-exec xprog] package [arguments...] · Run <str> for details.go · unclassified-diagnostic · outer go run · gap stage-unknownBeweisqualität: complete · Umgebungsvarianten: 1 · Zuerst erfasst: 2026-08-31 · Zuletzt gesehen: 2026-08-31Kandidat für diagnostische Neuprüfung
-
beobachtet UNKNOWN exit 1 Beweislücke ×1 v2.1.0 os=linux · runtime=go@1.26 github.com/russross/blackfriday/v2.CodeBlock sha256:0fe9af72c24d…Contract verification failed: expected <str>language-go\<str> in FencedCode backtick output, got: <pre><code class=<str>>fmt.Println("testing") …go · unclassified-diagnostic · outer go run · gap stage-unknownBeweisqualität: complete · Umgebungsvarianten: 1 · Zuerst erfasst: 2026-08-31 · Zuletzt gesehen: 2026-08-31Kandidat für diagnostische Neuprüfung
-
beobachtet UNKNOWN exit 1 Beweislücke ×1 v2.1.0 os=linux · runtime=go@1.26 sha256:16f67eb44d58…Contract verification failed: expected empty Document to have nil FirstChild, got: Heading: <str> · exit status 1go · unclassified-diagnostic · outer go run · gap stage-unknownBeweisqualität: complete · Umgebungsvarianten: 1 · Zuerst erfasst: 2026-08-31 · Zuletzt gesehen: 2026-08-31Kandidat für diagnostische Neuprüfung
-
beobachtet UNKNOWN exit 1 Beweislücke ×1 v2.1.0 os=linux · runtime=go@1.26 github.com/russross/blackfriday/v2.CodeBlock sha256:2d98da748a0c…Contract verification failed: expected raw fenced backticks in paragraph with WithNoExtensions, got: <p><code>go · fmt.Println("testing") …go · unclassified-diagnostic · outer go run · gap stage-unknownBeweisqualität: complete · Umgebungsvarianten: 1 · Zuerst erfasst: 2026-08-31 · Zuletzt gesehen: 2026-08-31Kandidat für diagnostische Neuprüfung
Es werden die 12 meistgemeldeten von 23 aufgezeichneten Fehlerclustern gezeigt. Der Rest sind Einzelmeldungen.